{"text_format":"1","workbook":"xlsx","n_sheets":5,"sheets":["Base de datos empleados","Ingresar empleados","Consultar empleados","Aux","Hoja1"],"not_rendered":{"charts":0,"images":2,"macros":1,"external_links":0,"defined_names":2,"comments":0,"pivot_tables":0},"unopened":[],"bounds":{"document_bytes":16777216,"sheet_cells":100000,"rows_first":2000,"rows_last":500,"rows_between":2000,"halvings":0,"cell_chars":16384,"cell_head_chars":4096},"cells_cut":0,"cells_raw":0,"read":"whole","date_system":"1900"}

{"sheet":"Base de datos empleados","index":0,"n_rows":498,"n_cols":13,"rows_kept":498,"cut":false,"hidden":false,"merged":[]}
[]
[]
["Información Personal"]
["Fecha de Ingreso"," N° de Empleado","Nombre","Apellido","Fecha de Nacimiento","Lugar de nacimiento","Cédula","Sexo","Estado Civil","Correo electrónico","Teléfono"]
[]
[]
[]
[]
[]
[]
[]
[]
[]
[]
[]
[]
[]
[null,null,null,null,null,null,null,null,null,null,null,{"$f":"A18","v":"00:00:00"},{"$f":"B18","v":0}]
[null,null,null,null,null,null,null,null,null,null,null,"00:00:00",0]
[null,null,null,null,null,null,null,null,null,null,null,"00:00:00",0]
[null,null,null,null,null,null,null,null,null,null,null,"00:00:00",0]
[null,null,null,null,null,null,null,null,null,null,null,"00:00:00",0]
[null,null,null,null,null,null,null,null,null,null,null,"00:00:00",0]
[null,null,null,null,null,null,null,null,null,null,null,"00:00:00",0]
[null,null,null,null,null,null,null,null,null,null,null,"00:00:00",0]
[null,null,null,null,null,null,null,null,null,null,null,"00:00:00",0]
[null,null,null,null,null,null,null,null,null,null,null,"00:00:00",0]
[null,null,null,null,null,null,null,null,null,null,null,"00:00:00",0]
[null,null,null,null,null,null,null,null,null,null,null,"00:00:00",0]
[null,null,null,null,null,null,null,null,null,null,null,"00:00:00",0]
[null,null,null,null,null,null,null,null,null,null,null,"00:00:00",0]
[null,null,null,null,null,null,null,null,null,null,null,"00:00:00",0]
[null,null,null,null,null,null,null,null,null,null,null,"00:00:00",0]
[null,null,null,null,null,null,null,null,null,null,null,"00:00:00",0]
[null,null,null,null,null,null,null,null,null,null,null,"00:00:00",0]
[null,null,null,null,null,null,null,null,null,null,null,"00:00:00",0]
[null,null,null,null,null,null,null,null,null,null,null,"00:00:00",0]
[null,null,null,null,null,null,null,null,null,null,null,{"$f":"A38","v":"00:00:00"},0]
[null,null,null,null,null,null,null,null,null,null,null,"00:00:00",0]
[null,null,null,null,null,null,null,null,null,null,null,"00:00:00",0]
[null,null,null,null,null,null,null,null,null,null,null,"00:00:00",0]
[null,null,null,null,null,null,null,null,null,null,null,"00:00:00",0]
[null,null,null,null,null,null,null,null,null,null,null,"00:00:00",0]
[null,null,null,null,null,null,null,null,null,null,null,"00:00:00",0]
[null,null,null,null,null,null,null,null,null,null,null,"00:00:00",0]
[null,null,null,null,null,null,null,null,null,null,null,"00:00:00",0]
[null,null,null,null,null,null,null,null,null,null,null,"00:00:00",0]
[null,null,null,null,null,null,null,null,null,null,null,"00:00:00",0]
[null,null,null,null,null,null,null,null,null,null,null,"00:00:00",0]
[null,null,null,null,null,null,null,null,null,null,null,"00:00:00",0]
[null,null,null,null,null,null,null,null,null,null,null,"00:00:00",0]
[null,null,null,null,null,null,null,null,null,null,null,"00:00:00",0]
[null,null,null,null,null,null,null,null,null,null,null,"00:00:00",0]
[null,null,null,null,null,null,null,null,null,null,null,"00:00:00",0]
[null,null,null,null,null,null,null,null,null,null,null,"00:00:00",0]
[null,null,null,null,null,null,null,null,null,null,null,"00:00:00",0]
[null,null,null,null,null,null,null,null,null,null,null,"00:00:00",0]
[null,null,null,null,null,null,null,null,null,null,null,"00:00:00",0]
[null,null,null,null,null,null,null,null,null,null,null,"00:00:00",0]
[null,null,null,null,null,null,null,null,null,null,null,"00:00:00",0]
[null,null,null,null,null,null,null,null,null,null,null,"00:00:00",0]
[null,null,null,null,null,null,null,null,null,null,null,"00:00:00",0]
[null,null,null,null,null,null,null,null,null,null,null,"00:00:00",0]
[null,null,null,null,null,null,null,null,null,null,null,"00:00:00",0]
[null,null,null,null,null,null,null,null,null,null,null,"00:00:00",0]
[null,null,null,null,null,null,null,null,null,null,null,"00:00:00",0]
[null,null,null,null,null,null,null,null,null,null,null,"00:00:00",0]
[null,null,null,null,null,null,null,null,null,null,null,{"$f":"A68","v":"00:00:00"},{"$f":"B68","v":0}]
[null,null,null,null,null,null,null,null,null,null,null,"00:00:00",0]
[null,null,null,null,null,null,null,null,null,null,null,"00:00:00",0]
[null,null,null,null,null,null,null,null,null,null,null,"00:00:00",0]
[null,null,null,null,null,null,null,null,null,null,null,"00:00:00",0]
[null,null,null,null,null,null,null,null,null,null,null,"00:00:00",0]
[null,null,null,null,null,null,null,null,null,null,null,"00:00:00",0]
[null,null,null,null,null,null,null,null,null,null,null,"00:00:00",0]
[null,null,null,null,null,null,null,null,null,null,null,"00:00:00",0]
[null,null,null,null,null,null,null,null,null,null,null,"00:00:00",0]
[null,null,null,null,null,null,null,null,null,null,null,"00:00:00",0]
[null,null,null,null,null,null,null,null,null,null,null,"00:00:00",0]
[null,null,null,null,null,null,null,null,null,null,null,"00:00:00",0]
{"$rows_left_out":419}
{"sheet":"Ingresar empleados","index":1,"n_rows":16,"n_cols":2,"rows_kept":16,"cut":false,"hidden":false,"merged":[[12,2,12,4],[13,2,13,4],[14,2,14,4],[15,2,15,4],[7,2,7,4],[8,2,8,4],[9,2,9,4],[10,2,10,4],[11,2,11,4]]}
[]
[]
[null,"Ingreso de nuevo empleado"]
[null," N° de Empleado"]
[null,"Fecha de Ingreso Empresa"]
[]
[null,"Información Personal"]
[null,"Nombre"]
[null,"Apellido"]
[null,"Fecha de Nacimiento"]
[null,"Lugar de nacimiento"]
[null,"Cédula"]
[null,"Sexo"]
[null,"Estado Civil"]
[null,"Correo electrónico"]
[null,"Teléfono"]

{"sheet":"Consultar empleados","index":2,"n_rows":18,"n_cols":12,"rows_kept":18,"cut":false,"hidden":false,"merged":[[14,3,14,5],[15,3,15,5],[16,3,16,5],[17,3,17,5],[9,3,9,5],[10,3,10,5],[11,3,11,5],[12,3,12,5],[13,3,13,5]]}
[]
[]
[null,"Consultar Información de  Empleado",null,null,null,null,null,null,null,null,21,21]
[]
[null,null,"Empleado"]
[null,null," N° de Empleado",{"$f":"IFERROR(IF(INDEX('Base de datos empleados'!$B$5:$B$498,MATCH('Consultar empleados'!$D$5,CONCATENATE('Base de datos empleados'!$D$5:$D$498,\" \",'Base de datos empleados'!$C$5:$C$498),0),1)=\"\",\"\",INDEX('Base de datos empleados'!$B$5:$B$498,MATCH('Consultar empleados'!$D$5,CONCATENATE('Base de datos empleados'!$D$5:$D$498,\" \",'Base de datos empleados'!$C$5:$C$498),0),1)),\"\")","v":""}]
[null,null,"Fecha de Ingreso",{"$f":"IFERROR(IF(INDEX('Base de datos empleados'!$A$5:$A$500,MATCH('Consultar empleados'!$D$5,CONCATENATE('Base de datos empleados'!$D$5:$D$500,\" \",'Base de datos empleados'!$C$5:$C$500),0),1)=\"\",\"\",INDEX('Base de datos empleados'!$A$5:$A$500,MATCH('Consultar empleados'!$D$5,CONCATENATE('Base de datos empleados'!$D$5:$D$500,\" \",'Base de datos empleados'!$C$5:$C$500),0),1)),\"\")","v":""}]
[]
[]
[null,null,"Nombre"]
[null,null,"Apellido"]
[null,null,"Fecha de Nacimiento"]
[null,null,"Lugar de nacimiento"]
[null,null,"Cédula"]
[null,null,"Sexo"]
[null,null,"Estado Civil"]
[null,null,"Correo electrónico"]
[null,null,"Teléfono"]

{"sheet":"Aux","index":3,"n_rows":551,"n_cols":1,"rows_kept":551,"cut":false,"hidden":true,"merged":[]}
[]
[{"$f":"IF(OR('Base de datos empleados'!D5=\"\",'Base de datos empleados'!C5=\"\"),\"\",'Base de datos empleados'!D5&\" \"&'Base de datos empleados'!C5)","v":""}]
[{"$f":"IF(OR('Base de datos empleados'!D6=\"\",'Base de datos empleados'!C6=\"\"),\"\",'Base de datos empleados'!D6&\" \"&'Base de datos empleados'!C6)","v":""}]
[{"$f":"IF(OR('Base de datos empleados'!D7=\"\",'Base de datos empleados'!C7=\"\"),\"\",'Base de datos empleados'!D7&\" \"&'Base de datos empleados'!C7)","v":""}]
[{"$f":"IF(OR('Base de datos empleados'!D8=\"\",'Base de datos empleados'!C8=\"\"),\"\",'Base de datos empleados'!D8&\" \"&'Base de datos empleados'!C8)","v":""}]
[{"$f":"IF(OR('Base de datos empleados'!D9=\"\",'Base de datos empleados'!C9=\"\"),\"\",'Base de datos empleados'!D9&\" \"&'Base de datos empleados'!C9)","v":""}]
[{"$f":"IF(OR('Base de datos empleados'!D10=\"\",'Base de datos empleados'!C10=\"\"),\"\",'Base de datos empleados'!D10&\" \"&'Base de datos empleados'!C10)","v":""}]
[{"$f":"IF(OR('Base de datos empleados'!D11=\"\",'Base de datos empleados'!C11=\"\"),\"\",'Base de datos empleados'!D11&\" \"&'Base de datos empleados'!C11)","v":""}]
[{"$f":"IF(OR('Base de datos empleados'!D12=\"\",'Base de datos empleados'!C12=\"\"),\"\",'Base de datos empleados'!D12&\" \"&'Base de datos empleados'!C12)","v":""}]
[{"$f":"IF(OR('Base de datos empleados'!D13=\"\",'Base de datos empleados'!C13=\"\"),\"\",'Base de datos empleados'!D13&\" \"&'Base de datos empleados'!C13)","v":""}]
[{"$f":"IF(OR('Base de datos empleados'!D14=\"\",'Base de datos empleados'!C14=\"\"),\"\",'Base de datos empleados'!D14&\" \"&'Base de datos empleados'!C14)","v":""}]
[{"$f":"IF(OR('Base de datos empleados'!D15=\"\",'Base de datos empleados'!C15=\"\"),\"\",'Base de datos empleados'!D15&\" \"&'Base de datos empleados'!C15)","v":""}]
[{"$f":"IF(OR('Base de datos empleados'!D16=\"\",'Base de datos empleados'!C16=\"\"),\"\",'Base de datos empleados'!D16&\" \"&'Base de datos empleados'!C16)","v":""}]
[{"$f":"IF(OR('Base de datos empleados'!D17=\"\",'Base de datos empleados'!C17=\"\"),\"\",'Base de datos empleados'!D17&\" \"&'Base de datos empleados'!C17)","v":""}]
[{"$f":"IF(OR('Base de datos empleados'!D18=\"\",'Base de datos empleados'!C18=\"\"),\"\",'Base de datos empleados'!D18&\" \"&'Base de datos empleados'!C18)","v":""}]
[{"$f":"IF(OR('Base de datos empleados'!D19=\"\",'Base de datos empleados'!C19=\"\"),\"\",'Base de datos empleados'!D19&\" \"&'Base de datos empleados'!C19)","v":""}]
[{"$f":"IF(OR('Base de datos empleados'!D20=\"\",'Base de datos empleados'!C20=\"\"),\"\",'Base de datos empleados'!D20&\" \"&'Base de datos empleados'!C20)","v":""}]
[{"$f":"IF(OR('Base de datos empleados'!D21=\"\",'Base de datos empleados'!C21=\"\"),\"\",'Base de datos empleados'!D21&\" \"&'Base de datos empleados'!C21)","v":""}]
[{"$f":"IF(OR('Base de datos empleados'!D22=\"\",'Base de datos empleados'!C22=\"\"),\"\",'Base de datos empleados'!D22&\" \"&'Base de datos empleados'!C22)","v":""}]
[{"$f":"IF(OR('Base de datos empleados'!D23=\"\",'Base de datos empleados'!C23=\"\"),\"\",'Base de datos empleados'!D23&\" \"&'Base de datos empleados'!C23)","v":""}]
[{"$f":"IF(OR('Base de datos empleados'!D24=\"\",'Base de datos empleados'!C24=\"\"),\"\",'Base de datos empleados'!D24&\" \"&'Base de datos empleados'!C24)","v":""}]
[{"$f":"IF(OR('Base de datos empleados'!D25=\"\",'Base de datos empleados'!C25=\"\"),\"\",'Base de datos empleados'!D25&\" \"&'Base de datos empleados'!C25)","v":""}]
[{"$f":"IF(OR('Base de datos empleados'!D26=\"\",'Base de datos empleados'!C26=\"\"),\"\",'Base de datos empleados'!D26&\" \"&'Base de datos empleados'!C26)","v":""}]
[{"$f":"IF(OR('Base de datos empleados'!D27=\"\",'Base de datos empleados'!C27=\"\"),\"\",'Base de datos empleados'!D27&\" \"&'Base de datos empleados'!C27)","v":""}]
[{"$f":"IF(OR('Base de datos empleados'!D28=\"\",'Base de datos empleados'!C28=\"\"),\"\",'Base de datos empleados'!D28&\" \"&'Base de datos empleados'!C28)","v":""}]
[{"$f":"IF(OR('Base de datos empleados'!D29=\"\",'Base de datos empleados'!C29=\"\"),\"\",'Base de datos empleados'!D29&\" \"&'Base de datos empleados'!C29)","v":""}]
[{"$f":"IF(OR('Base de datos empleados'!D30=\"\",'Base de datos empleados'!C30=\"\"),\"\",'Base de datos empleados'!D30&\" \"&'Base de datos empleados'!C30)","v":""}]
[{"$f":"IF(OR('Base de datos empleados'!D31=\"\",'Base de datos empleados'!C31=\"\"),\"\",'Base de datos empleados'!D31&\" \"&'Base de datos empleados'!C31)","v":""}]
[{"$f":"IF(OR('Base de datos empleados'!D32=\"\",'Base de datos empleados'!C32=\"\"),\"\",'Base de datos empleados'!D32&\" \"&'Base de datos empleados'!C32)","v":""}]
[{"$f":"IF(OR('Base de datos empleados'!D33=\"\",'Base de datos empleados'!C33=\"\"),\"\",'Base de datos empleados'!D33&\" \"&'Base de datos empleados'!C33)","v":""}]
[{"$f":"IF(OR('Base de datos empleados'!D34=\"\",'Base de datos empleados'!C34=\"\"),\"\",'Base de datos empleados'!D34&\" \"&'Base de datos empleados'!C34)","v":""}]
[{"$f":"IF(OR('Base de datos empleados'!D35=\"\",'Base de datos empleados'!C35=\"\"),\"\",'Base de datos empleados'!D35&\" \"&'Base de datos empleados'!C35)","v":""}]
[{"$f":"IF(OR('Base de datos empleados'!D36=\"\",'Base de datos empleados'!C36=\"\"),\"\",'Base de datos empleados'!D36&\" \"&'Base de datos empleados'!C36)","v":""}]
[{"$f":"IF(OR('Base de datos empleados'!D37=\"\",'Base de datos empleados'!C37=\"\"),\"\",'Base de datos empleados'!D37&\" \"&'Base de datos empleados'!C37)","v":""}]
[{"$f":"IF(OR('Base de datos empleados'!D38=\"\",'Base de datos empleados'!C38=\"\"),\"\",'Base de datos empleados'!D38&\" \"&'Base de datos empleados'!C38)","v":""}]
[{"$f":"IF(OR('Base de datos empleados'!D39=\"\",'Base de datos empleados'!C39=\"\"),\"\",'Base de datos empleados'!D39&\" \"&'Base de datos empleados'!C39)","v":""}]
[{"$f":"IF(OR('Base de datos empleados'!D40=\"\",'Base de datos empleados'!C40=\"\"),\"\",'Base de datos empleados'!D40&\" \"&'Base de datos empleados'!C40)","v":""}]
[{"$f":"IF(OR('Base de datos empleados'!D41=\"\",'Base de datos empleados'!C41=\"\"),\"\",'Base de datos empleados'!D41&\" \"&'Base de datos empleados'!C41)","v":""}]
[{"$f":"IF(OR('Base de datos empleados'!D42=\"\",'Base de datos empleados'!C42=\"\"),\"\",'Base de datos empleados'!D42&\" \"&'Base de datos empleados'!C42)","v":""}]
[{"$f":"IF(OR('Base de datos empleados'!D43=\"\",'Base de datos empleados'!C43=\"\"),\"\",'Base de datos empleados'!D43&\" \"&'Base de datos empleados'!C43)","v":""}]
[{"$f":"IF(OR('Base de datos empleados'!D44=\"\",'Base de datos empleados'!C44=\"\"),\"\",'Base de datos empleados'!D44&\" \"&'Base de datos empleados'!C44)","v":""}]
[{"$f":"IF(OR('Base de datos empleados'!D45=\"\",'Base de datos empleados'!C45=\"\"),\"\",'Base de datos empleados'!D45&\" \"&'Base de datos empleados'!C45)","v":""}]
[{"$f":"IF(OR('Base de datos empleados'!D46=\"\",'Base de datos empleados'!C46=\"\"),\"\",'Base de datos empleados'!D46&\" \"&'Base de datos empleados'!C46)","v":""}]
[{"$f":"IF(OR('Base de datos empleados'!D47=\"\",'Base de datos empleados'!C47=\"\"),\"\",'Base de datos empleados'!D47&\" \"&'Base de datos empleados'!C47)","v":""}]
[{"$f":"IF(OR('Base de datos empleados'!D48=\"\",'Base de datos empleados'!C48=\"\"),\"\",'Base de datos empleados'!D48&\" \"&'Base de datos empleados'!C48)","v":""}]
[{"$f":"IF(OR('Base de datos empleados'!D49=\"\",'Base de datos empleados'!C49=\"\"),\"\",'Base de datos empleados'!D49&\" \"&'Base de datos empleados'!C49)","v":""}]
[{"$f":"IF(OR('Base de datos empleados'!D50=\"\",'Base de datos empleados'!C50=\"\"),\"\",'Base de datos empleados'!D50&\" \"&'Base de datos empleados'!C50)","v":""}]
[{"$f":"IF(OR('Base de datos empleados'!D51=\"\",'Base de datos empleados'!C51=\"\"),\"\",'Base de datos empleados'!D51&\" \"&'Base de datos empleados'!C51)","v":""}]
[{"$f":"IF(OR('Base de datos empleados'!D52=\"\",'Base de datos empleados'!C52=\"\"),\"\",'Base de datos empleados'!D52&\" \"&'Base de datos empleados'!C52)","v":""}]
[{"$f":"IF(OR('Base de datos empleados'!D53=\"\",'Base de datos empleados'!C53=\"\"),\"\",'Base de datos empleados'!D53&\" \"&'Base de datos empleados'!C53)","v":""}]
[{"$f":"IF(OR('Base de datos empleados'!D54=\"\",'Base de datos empleados'!C54=\"\"),\"\",'Base de datos empleados'!D54&\" \"&'Base de datos empleados'!C54)","v":""}]
[{"$f":"IF(OR('Base de datos empleados'!D55=\"\",'Base de datos empleados'!C55=\"\"),\"\",'Base de datos empleados'!D55&\" \"&'Base de datos empleados'!C55)","v":""}]
[{"$f":"IF(OR('Base de datos empleados'!D56=\"\",'Base de datos empleados'!C56=\"\"),\"\",'Base de datos empleados'!D56&\" \"&'Base de datos empleados'!C56)","v":""}]
[{"$f":"IF(OR('Base de datos empleados'!D57=\"\",'Base de datos empleados'!C57=\"\"),\"\",'Base de datos empleados'!D57&\" \"&'Base de datos empleados'!C57)","v":""}]
[{"$f":"IF(OR('Base de datos empleados'!D58=\"\",'Base de datos empleados'!C58=\"\"),\"\",'Base de datos empleados'!D58&\" \"&'Base de datos empleados'!C58)","v":""}]
[{"$f":"IF(OR('Base de datos empleados'!D59=\"\",'Base de datos empleados'!C59=\"\"),\"\",'Base de datos empleados'!D59&\" \"&'Base de datos empleados'!C59)","v":""}]
[{"$f":"IF(OR('Base de datos empleados'!D60=\"\",'Base de datos empleados'!C60=\"\"),\"\",'Base de datos empleados'!D60&\" \"&'Base de datos empleados'!C60)","v":""}]
[{"$f":"IF(OR('Base de datos empleados'!D61=\"\",'Base de datos empleados'!C61=\"\"),\"\",'Base de datos empleados'!D61&\" \"&'Base de datos empleados'!C61)","v":""}]
[{"$f":"IF(OR('Base de datos empleados'!D62=\"\",'Base de datos empleados'!C62=\"\"),\"\",'Base de datos empleados'!D62&\" \"&'Base de datos empleados'!C62)","v":""}]
[{"$f":"IF(OR('Base de datos empleados'!D63=\"\",'Base de datos empleados'!C63=\"\"),\"\",'Base de datos empleados'!D63&\" \"&'Base de datos empleados'!C63)","v":""}]
[{"$f":"IF(OR('Base de datos empleados'!D64=\"\",'Base de datos empleados'!C64=\"\"),\"\",'Base de datos empleados'!D64&\" \"&'Base de datos empleados'!C64)","v":""}]
[{"$f":"IF(OR('Base de datos empleados'!D65=\"\",'Base de datos empleados'!C65=\"\"),\"\",'Base de datos empleados'!D65&\" \"&'Base de datos empleados'!C65)","v":""}]
[{"$f":"IF(OR('Base de datos empleados'!D66=\"\",'Base de datos empleados'!C66=\"\"),\"\",'Base de datos empleados'!D66&\" \"&'Base de datos empleados'!C66)","v":""}]
[{"$f":"IF(OR('Base de datos empleados'!D67=\"\",'Base de datos empleados'!C67=\"\"),\"\",'Base de datos empleados'!D67&\" \"&'Base de datos empleados'!C67)","v":""}]
[{"$f":"IF(OR('Base de datos empleados'!D68=\"\",'Base de datos empleados'!C68=\"\"),\"\",'Base de datos empleados'!D68&\" \"&'Base de datos empleados'!C68)","v":""}]
[{"$f":"IF(OR('Base de datos empleados'!D69=\"\",'Base de datos empleados'!C69=\"\"),\"\",'Base de datos empleados'!D69&\" \"&'Base de datos empleados'!C69)","v":""}]
[{"$f":"IF(OR('Base de datos empleados'!D70=\"\",'Base de datos empleados'!C70=\"\"),\"\",'Base de datos empleados'!D70&\" \"&'Base de datos empleados'!C70)","v":""}]
[{"$f":"IF(OR('Base de datos empleados'!D71=\"\",'Base de datos empleados'!C71=\"\"),\"\",'Base de datos empleados'!D71&\" \"&'Base de datos empleados'!C71)","v":""}]
[{"$f":"IF(OR('Base de datos empleados'!D72=\"\",'Base de datos empleados'!C72=\"\"),\"\",'Base de datos empleados'!D72&\" \"&'Base de datos empleados'!C72)","v":""}]
[{"$f":"IF(OR('Base de datos empleados'!D73=\"\",'Base de datos empleados'!C73=\"\"),\"\",'Base de datos empleados'!D73&\" \"&'Base de datos empleados'!C73)","v":""}]
[{"$f":"IF(OR('Base de datos empleados'!D74=\"\",'Base de datos empleados'!C74=\"\"),\"\",'Base de datos empleados'!D74&\" \"&'Base de datos empleados'!C74)","v":""}]
[{"$f":"IF(OR('Base de datos empleados'!D75=\"\",'Base de datos empleados'!C75=\"\"),\"\",'Base de datos empleados'!D75&\" \"&'Base de datos empleados'!C75)","v":""}]
[{"$f":"IF(OR('Base de datos empleados'!D76=\"\",'Base de datos empleados'!C76=\"\"),\"\",'Base de datos empleados'!D76&\" \"&'Base de datos empleados'!C76)","v":""}]
[{"$f":"IF(OR('Base de datos empleados'!D77=\"\",'Base de datos empleados'!C77=\"\"),\"\",'Base de datos empleados'!D77&\" \"&'Base de datos empleados'!C77)","v":""}]
[{"$f":"IF(OR('Base de datos empleados'!D78=\"\",'Base de datos empleados'!C78=\"\"),\"\",'Base de datos empleados'!D78&\" \"&'Base de datos empleados'!C78)","v":""}]
[{"$f":"IF(OR('Base de datos empleados'!D79=\"\",'Base de datos empleados'!C79=\"\"),\"\",'Base de datos empleados'!D79&\" \"&'Base de datos empleados'!C79)","v":""}]
[{"$f":"IF(OR('Base de datos empleados'!D80=\"\",'Base de datos empleados'!C80=\"\"),\"\",'Base de datos empleados'!D80&\" \"&'Base de datos empleados'!C80)","v":""}]
[{"$f":"IF(OR('Base de datos empleados'!D81=\"\",'Base de datos empleados'!C81=\"\"),\"\",'Base de datos empleados'!D81&\" \"&'Base de datos empleados'!C81)","v":""}]
[{"$f":"IF(OR('Base de datos empleados'!D82=\"\",'Base de datos empleados'!C82=\"\"),\"\",'Base de datos empleados'!D82&\" \"&'Base de datos empleados'!C82)","v":""}]
[{"$f":"IF(OR('Base de datos empleados'!D83=\"\",'Base de datos empleados'!C83=\"\"),\"\",'Base de datos empleados'!D83&\" \"&'Base de datos empleados'!C83)","v":""}]
{"$rows_left_out":472}
{"sheet":"Hoja1","index":4,"n_rows":0,"n_cols":0,"rows_kept":0,"cut":false,"hidden":true,"merged":[]}