{"text_format":"1","workbook":"xlsx","n_sheets":4,"sheets":["- AYUDA -","Días tomados","Feriados y días laborables","Auxiliar"],"not_rendered":{"charts":0,"images":0,"macros":1,"external_links":0,"defined_names":34,"comments":1,"pivot_tables":0},"unopened":[],"bounds":{"document_bytes":16777216,"sheet_cells":100000,"rows_first":2000,"rows_last":500,"rows_between":2000,"halvings":0,"cell_chars":16384,"cell_head_chars":4096},"cells_cut":0,"cells_raw":0,"read":"whole","date_system":"1900"}

{"sheet":"- AYUDA -","index":0,"n_rows":4,"n_cols":2,"rows_kept":4,"cut":false,"hidden":false,"merged":[]}
[]
[]
[]
[null,"Ayuda"]

{"sheet":"Días tomados","index":1,"n_rows":59,"n_cols":386,"rows_kept":59,"cut":false,"hidden":false,"merged":[[10,374,11,374],[10,375,11,375],[10,381,10,385],[9,377,9,385],[10,377,11,377],[10,378,11,378],[10,379,11,379]]}
[]
[]
[]
[null,null,null,null,null,null,null,null,null,null,null,null,null,null,null,null,null,null,null,null,null,null,null,null,null,null,null,null,null,null,null,"x"]
[null,null,null,null,null,null,null,null,null,null,null,null,null,null,null,null,null,null,null,null,null,null,null,null,null,null,null,null,null,null,null,null,null,null,null,null,null,null,null,null,null,null,null,null,null,null,null,null,null,null,null,null,null,null,null,null,null,null,null,null,null,null,null,null,null,null,null,null,null,null,null,null,null,null,null,null,null,null,null,null,null,null,null,null,null,null,null,null,null,null,null,null,null,null,null,null,null,null,null,null,null,null,null,null,null,null,null,null,null,null,null,null,null,null,null,null,null,null,null,null,null,null,null,null,null,null,null,null,null,null,null,null,null,null,null,null,null,null,null,null,null,null,null,null,null,null,null,null,null,null,null,null,null,null,null,null,null,null,null,null,null,null,null,null,null,null,null,null,null,null,null,null,null,null,null,null,null,null,null,null,null,null,null,null,null,null,null,null,null,null,null,null,null,null,null,null,null,null,null,null,null,null,null,null,null,null,null,null,null,null,null,null,null,null,null,null,null,null,null,null,null,null,null,null,null,null,null,null,null,null,null,null,null,null,null,null,null,null,null,null,null,null,null,null,null,null,null,null,null,null,null,null,null,null,null,null,null,null,null,null,null,null,null,null,null,null,null,null,null,null,null,null,null,null,null,null,null,null,null,null,null,null,null,null,null,null,null,null,null,null,null,null,null,null,null,null,null,null,null,null,null,null,null,null,null,null,null,null,null,null,null,null,null,null,null,null,null,null,null,null,null,null,null,null,null,null,null,null,null,null,null,null,null,null,null,null,null,null,null,null,null,null,null,null,null,null,null,null,null,null,null,null,null,null,null,null,null,null,null,null,null,null,null,null,null,null,null,null,null,null,null,null,null,null,"Enfermedad","E"]
[null,null,null,null,null,null,null,null,null,null,null,null,null,null,null,null,null,null,null,null,null,null,null,null,null,null,null,null,null,null,null,null,null,null,null,null,null,null,null,null,null,null,null,null,null,null,null,null,null,null,null,null,null,null,null,null,null,null,null,null,null,null,null,null,null,null,null,null,null,null,null,null,null,null,null,null,null,null,null,null,null,null,null,null,null,null,null,null,null,null,null,null,null,null,null,null,null,null,null,null,null,null,null,null,null,null,null,null,null,null,null,null,null,null,null,null,null,null,null,null,null,null,null,null,null,null,null,null,null,null,null,null,null,null,null,null,null,null,null,null,null,null,null,null,null,null,null,null,null,null,null,null,null,null,null,null,null,null,null,null,null,null,null,null,null,null,null,null,null,null,null,null,null,null,null,null,null,null,null,null,null,null,null,null,null,null,null,null,null,null,null,null,null,null,null,null,null,null,null,null,null,null,null,null,null,null,null,null,null,null,null,null,null,null,null,null,null,null,null,null,null,null,null,null,null,null,null,null,null,null,null,null,null,null,null,null,null,null,null,null,null,null,null,null,null,null,null,null,null,null,null,null,null,null,null,null,null,null,null,null,null,null,null,null,null,null,null,null,null,null,null,null,null,null,null,null,null,null,null,null,null,null,null,null,null,null,null,null,null,null,null,null,null,null,null,null,null,null,null,null,null,null,null,null,null,null,null,null,null,null,null,null,null,null,null,null,null,null,null,null,null,null,null,null,null,null,null,null,null,null,null,null,null,null,null,null,null,null,null,null,null,null,null,null,null,null,null,null,null,null,null,null,null,null,null,null,null,null,null,null,null,null,null,null,null,null,null,null,null,null,null,null,null,null,"Vacaciones","V"]
[2021,null,null,null,null,null,null,null,null,null,null,null,null,null,null,null,null,null,null,null,null,null,null,null,null,null,null,null,null,null,null,null,null,null,null,null,null,null,null,null,null,null,null,null,null,null,null,null,null,null,null,null,null,null,null,null,null,null,null,null,null,null,null,null,null,null,null,null,null,null,null,null,null,null,null,null,null,null,null,null,null,null,null,null,null,null,null,null,null,null,null,null,null,null,null,null,null,null,null,null,null,null,null,null,null,null,null,null,null,null,null,null,null,null,null,null,null,null,null,null,null,null,null,null,null,null,null,null,null,null,null,null,null,null,null,null,null,null,null,null,null,null,null,null,null,null,null,null,null,null,null,null,null,null,null,null,null,null,null,null,null,null,null,null,null,null,null,null,null,null,null,null,null,null,null,null,null,null,null,null,null,null,null,null,null,null,null,null,null,null,null,null,null,null,null,null,null,null,null,null,null,null,null,null,null,null,null,null,null,null,null,null,null,null,null,null,null,null,null,null,null,null,null,null,null,null,null,null,null,null,null,null,null,null,null,null,null,null,null,null,null,null,null,null,null,null,null,null,null,null,null,null,null,null,null,null,null,null,null,null,null,null,null,null,null,null,null,null,null,null,null,null,null,null,null,null,null,null,null,null,null,null,null,null,null,null,null,null,null,null,null,null,null,null,null,null,null,null,null,null,null,null,null,null,null,null,null,null,null,null,null,null,null,null,null,null,null,null,null,null,null,null,null,null,null,null,null,null,null,null,null,null,null,null,null,null,null,null,null,null,null,null,null,null,null,null,null,null,null,null,null,null,null,null,null,null,null,null,null,null,null,null,null,null,null,null,null,null,null,null,null,null,null,null,"Maternidad","M"]
["Enero",null,null,null,null,null,null,null,null,null,null,null,null,null,null,null,null,null,null,null,null,null,null,null,null,null,null,null,null,null,null,null,null,null,null,null,null,null,null,null,null,null,null,null,null,null,null,null,null,null,null,null,null,null,null,null,null,null,null,null,null,null,null,null,null,null,null,null,null,null,null,null,null,null,null,null,null,null,null,null,null,null,null,null,null,null,null,null,null,null,null,null,null,null,null,null,null,null,null,null,null,null,null,null,null,null,null,null,null,null,null,null,null,null,null,null,null,null,null,null,null,null,null,null,null,null,null,null,null,null,null,null,null,null,null,null,null,null,null,null,null,null,null,null,null,null,null,null,null,null,null,null,null,null,null,null,null,null,null,null,null,null,null,null,null,null,null,null,null,null,null,null,null,null,null,null,null,null,null,null,null,null,null,null,null,null,null,null,null,null,null,null,null,null,null,null,null,null,null,null,null,null,null,null,null,null,null,null,null,null,null,null,null,null,null,null,null,null,null,null,null,null,null,null,null,null,null,null,null,null,null,null,null,null,null,null,null,null,null,null,null,null,null,null,null,null,null,null,null,null,null,null,null,null,null,null,null,null,null,null,null,null,null,null,null,null,null,null,null,null,null,null,null,null,null,null,null,null,null,null,null,null,null,null,null,null,null,null,null,null,null,null,null,null,null,null,null,null,null,null,null,null,null,null,null,null,null,null,null,null,null,null,null,null,null,null,null,null,null,null,null,null,null,null,null,null,null,null,null,null,null,null,null,null,null,null,null,null,null,null,null,null,null,null,null,null,null,null,null,null,null,null,null,null,null,null,null,null,null,null,null,null,null,null,null,null,null,null,null,null,null,null,null,null,"Trámites","T"]
[{"$f":"VLOOKUP(A8,Meses_num,2,0)","v":1},{"$f":"AND(NOT(ISNUMBER(MATCH(DATE($A$7,INT((COLUMN()-1)/31.001)+1,ROUNDUP(MOD(COLUMN()-1,31.001),0)),Feriados,0))),(VLOOKUP(VLOOKUP(WEEKDAY(DATE($A$7,INT((COLUMN()-1)/31.001)+1,ROUNDUP(MOD(COLUMN()-1,31.001),0)),2),Auxiliar!$D$1:$E$7,2,0),'Feriados y días laborables'!$E$5:$F$11,2,0)=\"Si\"))","v":true},{"$f":"AND(NOT(ISNUMBER(MATCH(DATE($A$7,INT((COLUMN()-1)/31.001)+1,ROUNDUP(MOD(COLUMN()-1,31.001),0)),Feriados,0))),(VLOOKUP(VLOOKUP(WEEKDAY(DATE($A$7,INT((COLUMN()-1)/31.001)+1,ROUNDUP(MOD(COLUMN()-1,31.001),0)),2),Auxiliar!$D$1:$E$7,2,0),'Feriados y días laborables'!$E$5:$F$11,2,0)=\"Si\"))","v":false},{"$f":"AND(NOT(ISNUMBER(MATCH(DATE($A$7,INT((COLUMN()-1)/31.001)+1,ROUNDUP(MOD(COLUMN()-1,31.001),0)),Feriados,0))),(VLOOKUP(VLOOKUP(WEEKDAY(DATE($A$7,INT((COLUMN()-1)/31.001)+1,ROUNDUP(MOD(COLUMN()-1,31.001),0)),2),Auxiliar!$D$1:$E$7,2,0),'Feriados y días laborables'!$E$5:$F$11,2,0)=\"Si\"))","v":false},{"$f":"AND(NOT(ISNUMBER(MATCH(DATE($A$7,INT((COLUMN()-1)/31.001)+1,ROUNDUP(MOD(COLUMN()-1,31.001),0)),Feriados,0))),(VLOOKUP(VLOOKUP(WEEKDAY(DATE($A$7,INT((COLUMN()-1)/31.001)+1,ROUNDUP(MOD(COLUMN()-1,31.001),0)),2),Auxiliar!$D$1:$E$7,2,0),'Feriados y días laborables'!$E$5:$F$11,2,0)=\"Si\"))","v":true},{"$f":"AND(NOT(ISNUMBER(MATCH(DATE($A$7,INT((COLUMN()-1)/31.001)+1,ROUNDUP(MOD(COLUMN()-1,31.001),0)),Feriados,0))),(VLOOKUP(VLOOKUP(WEEKDAY(DATE($A$7,INT((COLUMN()-1)/31.001)+1,ROUNDUP(MOD(COLUMN()-1,31.001),0)),2),Auxiliar!$D$1:$E$7,2,0),'Feriados y días laborables'!$E$5:$F$11,2,0)=\"Si\"))","v":true},{"$f":"AND(NOT(ISNUMBER(MATCH(DATE($A$7,INT((COLUMN()-1)/31.001)+1,ROUNDUP(MOD(COLUMN()-1,31.001),0)),Feriados,0))),(VLOOKUP(VLOOKUP(WEEKDAY(DATE($A$7,INT((COLUMN()-1)/31.001)+1,ROUNDUP(MOD(COLUMN()-1,31.001),0)),2),Auxiliar!$D$1:$E$7,2,0),'Feriados y días laborables'!$E$5:$F$11,2,0)=\"Si\"))","v":true},{"$f":"AND(NOT(ISNUMBER(MATCH(DATE($A$7,INT((COLUMN()-1)/31.001)+1,ROUNDUP(MOD(COLUMN()-1,31.001),0)),Feriados,0))),(VLOOKUP(VLOOKUP(WEEKDAY(DATE($A$7,INT((COLUMN()-1)/31.001)+1,ROUNDUP(MOD(COLUMN()-1,31.001),0)),2),Auxiliar!$D$1:$E$7,2,0),'Feriados y días laborables'!$E$5:$F$11,2,0)=\"Si\"))","v":true},{"$f":"AND(NOT(ISNUMBER(MATCH(DATE($A$7,INT((COLUMN()-1)/31.001)+1,ROUNDUP(MOD(COLUMN()-1,31.001),0)),Feriados,0))),(VLOOKUP(VLOOKUP(WEEKDAY(DATE($A$7,INT((COLUMN()-1)/31.001)+1,ROUNDUP(MOD(COLUMN()-1,31.001),0)),2),Auxiliar!$D$1:$E$7,2,0),'Feriados y días laborables'!$E$5:$F$11,2,0)=\"Si\"))","v":true},{"$f":"AND(NOT(ISNUMBER(MATCH(DATE($A$7,INT((COLUMN()-1)/31.001)+1,ROUNDUP(MOD(COLUMN()-1,31.001),0)),Feriados,0))),(VLOOKUP(VLOOKUP(WEEKDAY(DATE($A$7,INT((COLUMN()-1)/31.001)+1,ROUNDUP(MOD(COLUMN()-1,31.001),0)),2),Auxiliar!$D$1:$E$7,2,0),'Feriados y días laborables'!$E$5:$F$11,2,0)=\"Si\"))","v":false},{"$f":"AND(NOT(ISNUMBER(MATCH(DATE($A$7,INT((COLUMN()-1)/31.001)+1,ROUNDUP(MOD(COLUMN()-1,31.001),0)),Feriados,0))),(VLOOKUP(VLOOKUP(WEEKDAY(DATE($A$7,INT((COLUMN()-1)/31.001)+1,ROUNDUP(MOD(COLUMN()-1,31.001),0)),2),Auxiliar!$D$1:$E$7,2,0),'Feriados y días laborables'!$E$5:$F$11,2,0)=\"Si\"))","v":false},{"$f":"AND(NOT(ISNUMBER(MATCH(DATE($A$7,INT((COLUMN()-1)/31.001)+1,ROUNDUP(MOD(COLUMN()-1,31.001),0)),Feriados,0))),(VLOOKUP(VLOOKUP(WEEKDAY(DATE($A$7,INT((COLUMN()-1)/31.001)+1,ROUNDUP(MOD(COLUMN()-1,31.001),0)),2),Auxiliar!$D$1:$E$7,2,0),'Feriados y días laborables'!$E$5:$F$11,2,0)=\"Si\"))","v":true},{"$f":"AND(NOT(ISNUMBER(MATCH(DATE($A$7,INT((COLUMN()-1)/31.001)+1,ROUNDUP(MOD(COLUMN()-1,31.001),0)),Feriados,0))),(VLOOKUP(VLOOKUP(WEEKDAY(DATE($A$7,INT((COLUMN()-1)/31.001)+1,ROUNDUP(MOD(COLUMN()-1,31.001),0)),2),Auxiliar!$D$1:$E$7,2,0),'Feriados y días laborables'!$E$5:$F$11,2,0)=\"Si\"))","v":true},{"$f":"AND(NOT(ISNUMBER(MATCH(DATE($A$7,INT((COLUMN()-1)/31.001)+1,ROUNDUP(MOD(COLUMN()-1,31.001),0)),Feriados,0))),(VLOOKUP(VLOOKUP(WEEKDAY(DATE($A$7,INT((COLUMN()-1)/31.001)+1,ROUNDUP(MOD(COLUMN()-1,31.001),0)),2),Auxiliar!$D$1:$E$7,2,0),'Feriados y días laborables'!$E$5:$F$11,2,0)=\"Si\"))","v":true},{"$f":"AND(NOT(ISNUMBER(MATCH(DATE($A$7,INT((COLUMN()-1)/31.001)+1,ROUNDUP(MOD(COLUMN()-1,31.001),0)),Feriados,0))),(VLOOKUP(VLOOKUP(WEEKDAY(DATE($A$7,INT((COLUMN()-1)/31.001)+1,ROUNDUP(MOD(COLUMN()-1,31.001),0)),2),Auxiliar!$D$1:$E$7,2,0),'Feriados y días laborables'!$E$5:$F$11,2,0)=\"Si\"))","v":true},{"$f":"AND(NOT(ISNUMBER(MATCH(DATE($A$7,INT((COLUMN()-1)/31.001)+1,ROUNDUP(MOD(COLUMN()-1,31.001),0)),Feriados,0))),(VLOOKUP(VLOOKUP(WEEKDAY(DATE($A$7,INT((COLUMN()-1)/31.001)+1,ROUNDUP(MOD(COLUMN()-1,31.001),0)),2),Auxiliar!$D$1:$E$7,2,0),'Feriados y días laborables'!$E$5:$F$11,2,0)=\"Si\"))","v":true},{"$f":"AND(NOT(ISNUMBER(MATCH(DATE($A$7,INT((COLUMN()-1)/31.001)+1,ROUNDUP(MOD(COLUMN()-1,31.001),0)),Feriados,0))),(VLOOKUP(VLOOKUP(WEEKDAY(DATE($A$7,INT((COLUMN()-1)/31.001)+1,ROUNDUP(MOD(COLUMN()-1,31.001),0)),2),Auxiliar!$D$1:$E$7,2,0),'Feriados y días laborables'!$E$5:$F$11,2,0)=\"Si\"))","v":false},{"$f":"AND(NOT(ISNUMBER(MATCH(DATE($A$7,INT((COLUMN()-1)/31.001)+1,ROUNDUP(MOD(COLUMN()-1,31.001),0)),Feriados,0))),(VLOOKUP(VLOOKUP(WEEKDAY(DATE($A$7,INT((COLUMN()-1)/31.001)+1,ROUNDUP(MOD(COLUMN()-1,31.001),0)),2),Auxiliar!$D$1:$E$7,2,0),'Feriados y días laborables'!$E$5:$F$11,2,0)=\"Si\"))","v":false},{"$f":"AND(NOT(ISNUMBER(MATCH(DATE($A$7,INT((COLUMN()-1)/31.001)+1,ROUNDUP(MOD(COLUMN()-1,31.001),0)),Feriados,0))),(VLOOKUP(VLOOKUP(WEEKDAY(DATE($A$7,INT((COLUMN()-1)/31.001)+1,ROUNDUP(MOD(COLUMN()-1,31.001),0)),2),Auxiliar!$D$1:$E$7,2,0),'Feriados y días laborables'!$E$5:$F$11,2,0)=\"Si\"))","v":true},{"$f":"AND(NOT(ISNUMBER(MATCH(DATE($A$7,INT((COLUMN()-1)/31.001)+1,ROUNDUP(MOD(COLUMN()-1,31.001),0)),Feriados,0))),(VLOOKUP(VLOOKUP(WEEKDAY(DATE($A$7,INT((COLUMN()-1)/31.001)+1,ROUNDUP(MOD(COLUMN()-1,31.001),0)),2),Auxiliar!$D$1:$E$7,2,0),'Feriados y días laborables'!$E$5:$F$11,2,0)=\"Si\"))","v":true},{"$f":"AND(NOT(ISNUMBER(MATCH(DATE($A$7,INT((COLUMN()-1)/31.001)+1,ROUNDUP(MOD(COLUMN()-1,31.001),0)),Feriados,0))),(VLOOKUP(VLOOKUP(WEEKDAY(DATE($A$7,INT((COLUMN()-1)/31.001)+1,ROUNDUP(MOD(COLUMN()-1,31.001),0)),2),Auxiliar!$D$1:$E$7,2,0),'Feriados y días laborables'!$E$5:$F$11,2,0)=\"Si\"))","v":true},{"$f":"AND(NOT(ISNUMBER(MATCH(DATE($A$7,INT((COLUMN()-1)/31.001)+1,ROUNDUP(MOD(COLUMN()-1,31.001),0)),Feriados,0))),(VLOOKUP(VLOOKUP(WEEKDAY(DATE($A$7,INT((COLUMN()-1)/31.001)+1,ROUNDUP(MOD(COLUMN()-1,31.001),0)),2),Auxiliar!$D$1:$E$7,2,0),'Feriados y días laborables'!$E$5:$F$11,2,0)=\"Si\"))","v":true},{"$f":"AND(NOT(ISNUMBER(MATCH(DATE($A$7,INT((COLUMN()-1)/31.001)+1,ROUNDUP(MOD(COLUMN()-1,31.001),0)),Feriados,0))),(VLOOKUP(VLOOKUP(WEEKDAY(DATE($A$7,INT((COLUMN()-1)/31.001)+1,ROUNDUP(MOD(COLUMN()-1,31.001),0)),2),Auxiliar!$D$1:$E$7,2,0),'Feriados y días laborables'!$E$5:$F$11,2,0)=\"Si\"))","v":true},{"$f":"AND(NOT(ISNUMBER(MATCH(DATE($A$7,INT((COLUMN()-1)/31.001)+1,ROUNDUP(MOD(COLUMN()-1,31.001),0)),Feriados,0))),(VLOOKUP(VLOOKUP(WEEKDAY(DATE($A$7,INT((COLUMN()-1)/31.001)+1,ROUNDUP(MOD(COLUMN()-1,31.001),0)),2),Auxiliar!$D$1:$E$7,2,0),'Feriados y días laborables'!$E$5:$F$11,2,0)=\"Si\"))","v":false},{"$f":"AND(NOT(ISNUMBER(MATCH(DATE($A$7,INT((COLUMN()-1)/31.001)+1,ROUNDUP(MOD(COLUMN()-1,31.001),0)),Feriados,0))),(VLOOKUP(VLOOKUP(WEEKDAY(DATE($A$7,INT((COLUMN()-1)/31.001)+1,ROUNDUP(MOD(COLUMN()-1,31.001),0)),2),Auxiliar!$D$1:$E$7,2,0),'Feriados y días laborables'!$E$5:$F$11,2,0)=\"Si\"))","v":false},{"$f":"AND(NOT(ISNUMBER(MATCH(DATE($A$7,INT((COLUMN()-1)/31.001)+1,ROUNDUP(MOD(COLUMN()-1,31.001),0)),Feriados,0))),(VLOOKUP(VLOOKUP(WEEKDAY(DATE($A$7,INT((COLUMN()-1)/31.001)+1,ROUNDUP(MOD(COLUMN()-1,31.001),0)),2),Auxiliar!$D$1:$E$7,2,0),'Feriados y días laborables'!$E$5:$F$11,2,0)=\"Si\"))","v":true},{"$f":"AND(NOT(ISNUMBER(MATCH(DATE($A$7,INT((COLUMN()-1)/31.001)+1,ROUNDUP(MOD(COLUMN()-1,31.001),0)),Feriados,0))),(VLOOKUP(VLOOKUP(WEEKDAY(DATE($A$7,INT((COLUMN()-1)/31.001)+1,ROUNDUP(MOD(COLUMN()-1,31.001),0)),2),Auxiliar!$D$1:$E$7,2,0),'Feriados y días laborables'!$E$5:$F$11,2,0)=\"Si\"))","v":true},{"$f":"AND(NOT(ISNUMBER(MATCH(DATE($A$7,INT((COLUMN()-1)/31.001)+1,ROUNDUP(MOD(COLUMN()-1,31.001),0)),Feriados,0))),(VLOOKUP(VLOOKUP(WEEKDAY(DATE($A$7,INT((COLUMN()-1)/31.001)+1,ROUNDUP(MOD(COLUMN()-1,31.001),0)),2),Auxiliar!$D$1:$E$7,2,0),'Feriados y días laborables'!$E$5:$F$11,2,0)=\"Si\"))","v":true},{"$f":"AND(NOT(ISNUMBER(MATCH(DATE($A$7,INT((COLUMN()-1)/31.001)+1,ROUNDUP(MOD(COLUMN()-1,31.001),0)),Feriados,0))),(VLOOKUP(VLOOKUP(WEEKDAY(DATE($A$7,INT((COLUMN()-1)/31.001)+1,ROUNDUP(MOD(COLUMN()-1,31.001),0)),2),Auxiliar!$D$1:$E$7,2,0),'Feriados y días laborables'!$E$5:$F$11,2,0)=\"Si\"))","v":true},{"$f":"AND(NOT(ISNUMBER(MATCH(DATE($A$7,INT((COLUMN()-1)/31.001)+1,ROUNDUP(MOD(COLUMN()-1,31.001),0)),Feriados,0))),(VLOOKUP(VLOOKUP(WEEKDAY(DATE($A$7,INT((COLUMN()-1)/31.001)+1,ROUNDUP(MOD(COLUMN()-1,31.001),0)),2),Auxiliar!$D$1:$E$7,2,0),'Feriados y días laborables'!$E$5:$F$11,2,0)=\"Si\"))","v":true},{"$f":"AND(NOT(ISNUMBER(MATCH(DATE($A$7,INT((COLUMN()-1)/31.001)+1,ROUNDUP(MOD(COLUMN()-1,31.001),0)),Feriados,0))),(VLOOKUP(VLOOKUP(WEEKDAY(DATE($A$7,INT((COLUMN()-1)/31.001)+1,ROUNDUP(MOD(COLUMN()-1,31.001),0)),2),Auxiliar!$D$1:$E$7,2,0),'Feriados y días laborables'!$E$5:$F$11,2,0)=\"Si\"))","v":false},{"$f":"AND(NOT(ISNUMBER(MATCH(DATE($A$7,INT((COLUMN()-1)/31.001)+1,ROUNDUP(MOD(COLUMN()-1,31.001),0)),Feriados,0))),(VLOOKUP(VLOOKUP(WEEKDAY(DATE($A$7,INT((COLUMN()-1)/31.001)+1,ROUNDUP(MOD(COLUMN()-1,31.001),0)),2),Auxiliar!$D$1:$E$7,2,0),'Feriados y días laborables'!$E$5:$F$11,2,0)=\"Si\"))","v":false},{"$f":"AND(NOT(ISNUMBER(MATCH(DATE($A$7,INT((COLUMN()-1)/31.001)+1,ROUNDUP(MOD(COLUMN()-1,31.001),0)),Feriados,0))),(VLOOKUP(VLOOKUP(WEEKDAY(DATE($A$7,INT((COLUMN()-1)/31.001)+1,ROUNDUP(MOD(COLUMN()-1,31.001),0)),2),Auxiliar!$D$1:$E$7,2,0),'Feriados y días laborables'!$E$5:$F$11,2,0)=\"Si\"))","v":true},{"$f":"AND(NOT(ISNUMBER(MATCH(DATE($A$7,INT((COLUMN()-1)/31.001)+1,ROUNDUP(MOD(COLUMN()-1,31.001),0)),Feriados,0))),(VLOOKUP(VLOOKUP(WEEKDAY(DATE($A$7,INT((COLUMN()-1)/31.001)+1,ROUNDUP(MOD(COLUMN()-1,31.001),0)),2),Auxiliar!$D$1:$E$7,2,0),'Feriados y días laborables'!$E$5:$F$11,2,0)=\"Si\"))","v":true},{"$f":"AND(NOT(ISNUMBER(MATCH(DATE($A$7,INT((COLUMN()-1)/31.001)+1,ROUNDUP(MOD(COLUMN()-1,31.001),0)),Feriados,0))),(VLOOKUP(VLOOKUP(WEEKDAY(DATE($A$7,INT((COLUMN()-1)/31.001)+1,ROUNDUP(MOD(COLUMN()-1,31.001),0)),2),Auxiliar!$D$1:$E$7,2,0),'Feriados y días laborables'!$E$5:$F$11,2,0)=\"Si\"))","v":true},{"$f":"AND(NOT(ISNUMBER(MATCH(DATE($A$7,INT((COLUMN()-1)/31.001)+1,ROUNDUP(MOD(COLUMN()-1,31.001),0)),Feriados,0))),(VLOOKUP(VLOOKUP(WEEKDAY(DATE($A$7,INT((COLUMN()-1)/31.001)+1,ROUNDUP(MOD(COLUMN()-1,31.001),0)),2),Auxiliar!$D$1:$E$7,2,0),'Feriados y días laborables'!$E$5:$F$11,2,0)=\"Si\"))","v":true},{"$f":"AND(NOT(ISNUMBER(MATCH(DATE($A$7,INT((COLUMN()-1)/31.001)+1,ROUNDUP(MOD(COLUMN()-1,31.001),0)),Feriados,0))),(VLOOKUP(VLOOKUP(WEEKDAY(DATE($A$7,INT((COLUMN()-1)/31.001)+1,ROUNDUP(MOD(COLUMN()-1,31.001),0)),2),Auxiliar!$D$1:$E$7,2,0),'Feriados y días laborables'!$E$5:$F$11,2,0)=\"Si\"))","v":true},{"$f":"AND(NOT(ISNUMBER(MATCH(DATE($A$7,INT((COLUMN()-1)/31.001)+1,ROUNDUP(MOD(COLUMN()-1,31.001),0)),Feriados,0))),(VLOOKUP(VLOOKUP(WEEKDAY(DATE($A$7,INT((COLUMN()-1)/31.001)+1,ROUNDUP(MOD(COLUMN()-1,31.001),0)),2),Auxiliar!$D$1:$E$7,2,0),'Feriados y días laborables'!$E$5:$F$11,2,0)=\"Si\"))","v":false},{"$f":"AND(NOT(ISNUMBER(MATCH(DATE($A$7,INT((COLUMN()-1)/31.001)+1,ROUNDUP(MOD(COLUMN()-1,31.001),0)),Feriados,0))),(VLOOKUP(VLOOKUP(WEEKDAY(DATE($A$7,INT((COLUMN()-1)/31.001)+1,ROUNDUP(MOD(COLUMN()-1,31.001),0)),2),Auxiliar!$D$1:$E$7,2,0),'Feriados y días laborables'!$E$5:$F$11,2,0)=\"Si\"))","v":false},{"$f":"AND(NOT(ISNUMBER(MATCH(DATE($A$7,INT((COLUMN()-1)/31.001)+1,ROUNDUP(MOD(COLUMN()-1,31.001),0)),Feriados,0))),(VLOOKUP(VLOOKUP(WEEKDAY(DATE($A$7,INT((COLUMN()-1)/31.001)+1,ROUNDUP(MOD(COLUMN()-1,31.001),0)),2),Auxiliar!$D$1:$E$7,2,0),'Feriados y días laborables'!$E$5:$F$11,2,0)=\"Si\"))","v":true},{"$f":"AND(NOT(ISNUMBER(MATCH(DATE($A$7,INT((COLUMN()-1)/31.001)+1,ROUNDUP(MOD(COLUMN()-1,31.001),0)),Feriados,0))),(VLOOKUP(VLOOKUP(WEEKDAY(DATE($A$7,INT((COLUMN()-1)/31.001)+1,ROUNDUP(MOD(COLUMN()-1,31.001),0)),2),Auxiliar!$D$1:$E$7,2,0),'Feriados y días laborables'!$E$5:$F$11,2,0)=\"Si\"))","v":true},{"$f":"AND(NOT(ISNUMBER(MATCH(DATE($A$7,INT((COLUMN()-1)/31.001)+1,ROUNDUP(MOD(COLUMN()-1,31.001),0)),Feriados,0))),(VLOOKUP(VLOOKUP(WEEKDAY(DATE($A$7,INT((COLUMN()-1)/31.001)+1,ROUNDUP(MOD(COLUMN()-1,31.001),0)),2),Auxiliar!$D$1:$E$7,2,0),'Feriados y días laborables'!$E$5:$F$11,2,0)=\"Si\"))","v":true},{"$f":"AND(NOT(ISNUMBER(MATCH(DATE($A$7,INT((COLUMN()-1)/31.001)+1,ROUNDUP(MOD(COLUMN()-1,31.001),0)),Feriados,0))),(VLOOKUP(VLOOKUP(WEEKDAY(DATE($A$7,INT((COLUMN()-1)/31.001)+1,ROUNDUP(MOD(COLUMN()-1,31.001),0)),2),Auxiliar!$D$1:$E$7,2,0),'Feriados y días laborables'!$E$5:$F$11,2,0)=\"Si\"))","v":true},{"$f":"AND(NOT(ISNUMBER(MATCH(DATE($A$7,INT((COLUMN()-1)/31.001)+1,ROUNDUP(MOD(COLUMN()-1,31.001),0)),Feriados,0))),(VLOOKUP(VLOOKUP(WEEKDAY(DATE($A$7,INT((COLUMN()-1)/31.001)+1,ROUNDUP(MOD(COLUMN()-1,31.001),0)),2),Auxiliar!$D$1:$E$7,2,0),'Feriados y días laborables'!$E$5:$F$11,2,0)=\"Si\"))","v":true},{"$f":"AND(NOT(ISNUMBER(MATCH(DATE($A$7,INT((COLUMN()-1)/31.001)+1,ROUNDUP(MOD(COLUMN()-1,31.001),0)),Feriados,0))),(VLOOKUP(VLOOKUP(WEEKDAY(DATE($A$7,INT((COLUMN()-1)/31.001)+1,ROUNDUP(MOD(COLUMN()-1,31.001),0)),2),Auxiliar!$D$1:$E$7,2,0),'Feriados y días laborables'!$E$5:$F$11,2,0)=\"Si\"))","v":false},{"$f":"AND(NOT(ISNUMBER(MATCH(DATE($A$7,INT((COLUMN()-1)/31.001)+1,ROUNDUP(MOD(COLUMN()-1,31.001),0)),Feriados,0))),(VLOOKUP(VLOOKUP(WEEKDAY(DATE($A$7,INT((COLUMN()-1)/31.001)+1,ROUNDUP(MOD(COLUMN()-1,31.001),0)),2),Auxiliar!$D$1:$E$7,2,0),'Feriados y días laborables'!$E$5:$F$11,2,0)=\"Si\"))","v":false},{"$f":"AND(NOT(ISNUMBER(MATCH(DATE($A$7,INT((COLUMN()-1)/31.001)+1,ROUNDUP(MOD(COLUMN()-1,31.001),0)),Feriados,0))),(VLOOKUP(VLOOKUP(WEEKDAY(DATE($A$7,INT((COLUMN()-1)/31.001)+1,ROUNDUP(MOD(COLUMN()-1,31.001),0)),2),Auxiliar!$D$1:$E$7,2,0),'Feriados y días laborables'!$E$5:$F$11,2,0)=\"Si\"))","v":true},{"$f":"AND(NOT(ISNUMBER(MATCH(DATE($A$7,INT((COLUMN()-1)/31.001)+1,ROUNDUP(MOD(COLUMN()-1,31.001),0)),Feriados,0))),(VLOOKUP(VLOOKUP(WEEKDAY(DATE($A$7,INT((COLUMN()-1)/31.001)+1,ROUNDUP(MOD(COLUMN()-1,31.001),0)),2),Auxiliar!$D$1:$E$7,2,0),'Feriados y días laborables'!$E$5:$F$11,2,0)=\"Si\"))","v":true},{"$f":"AND(NOT(ISNUMBER(MATCH(DATE($A$7,INT((COLUMN()-1)/31.001)+1,ROUNDUP(MOD(COLUMN()-1,31.001),0)),Feriados,0))),(VLOOKUP(VLOOKUP(WEEKDAY(DATE($A$7,INT((COLUMN()-1)/31.001)+1,ROUNDUP(MOD(COLUMN()-1,31.001),0)),2),Auxiliar!$D$1:$E$7,2,0),'Feriados y días laborables'!$E$5:$F$11,2,0)=\"Si\"))","v":true},{"$f":"AND(NOT(ISNUMBER(MATCH(DATE($A$7,INT((COLUMN()-1)/31.001)+1,ROUNDUP(MOD(COLUMN()-1,31.001),0)),Feriados,0))),(VLOOKUP(VLOOKUP(WEEKDAY(DATE($A$7,INT((COLUMN()-1)/31.001)+1,ROUNDUP(MOD(COLUMN()-1,31.001),0)),2),Auxiliar!$D$1:$E$7,2,0),'Feriados y días laborables'!$E$5:$F$11,2,0)=\"Si\"))","v":true},{"$f":"AND(NOT(ISNUMBER(MATCH(DATE($A$7,INT((COLUMN()-1)/31.001)+1,ROUNDUP(MOD(COLUMN()-1,31.001),0)),Feriados,0))),(VLOOKUP(VLOOKUP(WEEKDAY(DATE($A$7,INT((COLUMN()-1)/31.001)+1,ROUNDUP(MOD(COLUMN()-1,31.001),0)),2),Auxiliar!$D$1:$E$7,2,0),'Feriados y días laborables'!$E$5:$F$11,2,0)=\"Si\"))","v":true},{"$f":"AND(NOT(ISNUMBER(MATCH(DATE($A$7,INT((COLUMN()-1)/31.001)+1,ROUNDUP(MOD(COLUMN()-1,31.001),0)),Feriados,0))),(VLOOKUP(VLOOKUP(WEEKDAY(DATE($A$7,INT((COLUMN()-1)/31.001)+1,ROUNDUP(MOD(COLUMN()-1,31.001),0)),2),Auxiliar!$D$1:$E$7,2,0),'Feriados y días laborables'!$E$5:$F$11,2,0)=\"Si\"))","v":false},{"$f":"AND(NOT(ISNUMBER(MATCH(DATE($A$7,INT((COLUMN()-1)/31.001)+1,ROUNDUP(MOD(COLUMN()-1,31.001),0)),Feriados,0))),(VLOOKUP(VLOOKUP(WEEKDAY(DATE($A$7,INT((COLUMN()-1)/31.001)+1,ROUNDUP(MOD(COLUMN()-1,31.001),0)),2),Auxiliar!$D$1:$E$7,2,0),'Feriados y días laborables'!$E$5:$F$11,2,0)=\"Si\"))","v":false},{"$f":"AND(NOT(ISNUMBER(MATCH(DATE($A$7,INT((COLUMN()-1)/31.001)+1,ROUNDUP(MOD(COLUMN()-1,31.001),0)),Feriados,0))),(VLOOKUP(VLOOKUP(WEEKDAY(DATE($A$7,INT((COLUMN()-1)/31.001)+1,ROUNDUP(MOD(COLUMN()-1,31.001),0)),2),Auxiliar!$D$1:$E$7,2,0),'Feriados y días laborables'!$E$5:$F$11,2,0)=\"Si\"))","v":true},{"$f":"AND(NOT(ISNUMBER(MATCH(DATE($A$7,INT((COLUMN()-1)/31.001)+1,ROUNDUP(MOD(COLUMN()-1,31.001),0)),Feriados,0))),(VLOOKUP(VLOOKUP(WEEKDAY(DATE($A$7,INT((COLUMN()-1)/31.001)+1,ROUNDUP(MOD(COLUMN()-1,31.001),0)),2),Auxiliar!$D$1:$E$7,2,0),'Feriados y días laborables'!$E$5:$F$11,2,0)=\"Si\"))","v":true},{"$f":"AND(NOT(ISNUMBER(MATCH(DATE($A$7,INT((COLUMN()-1)/31.001)+1,ROUNDUP(MOD(COLUMN()-1,31.001),0)),Feriados,0))),(VLOOKUP(VLOOKUP(WEEKDAY(DATE($A$7,INT((COLUMN()-1)/31.001)+1,ROUNDUP(MOD(COLUMN()-1,31.001),0)),2),Auxiliar!$D$1:$E$7,2,0),'Feriados y días laborables'!$E$5:$F$11,2,0)=\"Si\"))","v":true},{"$f":"AND(NOT(ISNUMBER(MATCH(DATE($A$7,INT((COLUMN()-1)/31.001)+1,ROUNDUP(MOD(COLUMN()-1,31.001),0)),Feriados,0))),(VLOOKUP(VLOOKUP(WEEKDAY(DATE($A$7,INT((COLUMN()-1)/31.001)+1,ROUNDUP(MOD(COLUMN()-1,31.001),0)),2),Auxiliar!$D$1:$E$7,2,0),'Feriados y días laborables'!$E$5:$F$11,2,0)=\"Si\"))","v":true},{"$f":"AND(NOT(ISNUMBER(MATCH(DATE($A$7,INT((COLUMN()-1)/31.001)+1,ROUNDUP(MOD(COLUMN()-1,31.001),0)),Feriados,0))),(VLOOKUP(VLOOKUP(WEEKDAY(DATE($A$7,INT((COLUMN()-1)/31.001)+1,ROUNDUP(MOD(COLUMN()-1,31.001),0)),2),Auxiliar!$D$1:$E$7,2,0),'Feriados y días laborables'!$E$5:$F$11,2,0)=\"Si\"))","v":true},{"$f":"AND(NOT(ISNUMBER(MATCH(DATE($A$7,INT((COLUMN()-1)/31.001)+1,ROUNDUP(MOD(COLUMN()-1,31.001),0)),Feriados,0))),(VLOOKUP(VLOOKUP(WEEKDAY(DATE($A$7,INT((COLUMN()-1)/31.001)+1,ROUNDUP(MOD(COLUMN()-1,31.001),0)),2),Auxiliar!$D$1:$E$7,2,0),'Feriados y días laborables'!$E$5:$F$11,2,0)=\"Si\"))","v":false},{"$f":"AND(NOT(ISNUMBER(MATCH(DATE($A$7,INT((COLUMN()-1)/31.001)+1,ROUNDUP(MOD(COLUMN()-1,31.001),0)),Feriados,0))),(VLOOKUP(VLOOKUP(WEEKDAY(DATE($A$7,INT((COLUMN()-1)/31.001)+1,ROUNDUP(MOD(COLUMN()-1,31.001),0)),2),Auxiliar!$D$1:$E$7,2,0),'Feriados y días laborables'!$E$5:$F$11,2,0)=\"Si\"))","v":false},{"$f":"AND(NOT(ISNUMBER(MATCH(DATE($A$7,INT((COLUMN()-1)/31.001)+1,ROUNDUP(MOD(COLUMN()-1,31.001),0)),Feriados,0))),(VLOOKUP(VLOOKUP(WEEKDAY(DATE($A$7,INT((COLUMN()-1)/31.001)+1,ROUNDUP(MOD(COLUMN()-1,31.001),0)),2),Auxiliar!$D$1:$E$7,2,0),'Feriados y días laborables'!$E$5:$F$11,2,0)=\"Si\"))","v":true},{"$f":"AND(NOT(ISNUMBER(MATCH(DATE($A$7,INT((COLUMN()-1)/31.001)+1,ROUNDUP(MOD(COLUMN()-1,31.001),0)),Feriados,0))),(VLOOKUP(VLOOKUP(WEEKDAY(DATE($A$7,INT((COLUMN()-1)/31.001)+1,ROUNDUP(MOD(COLUMN()-1,31.001),0)),2),Auxiliar!$D$1:$E$7,2,0),'Feriados y días laborables'!$E$5:$F$11,2,0)=\"Si\"))","v":true},{"$f":"AND(NOT(ISNUMBER(MATCH(DATE($A$7,INT((COLUMN()-1)/31.001)+1,ROUNDUP(MOD(COLUMN()-1,31.001),0)),Feriados,0))),(VLOOKUP(VLOOKUP(WEEKDAY(DATE($A$7,INT((COLUMN()-1)/31.001)+1,ROUNDUP(MOD(COLUMN()-1,31.001),0)),2),Auxiliar!$D$1:$E$7,2,0),'Feriados y días laborables'!$E$5:$F$11,2,0)=\"Si\"))","v":true},{"$f":"AND(NOT(ISNUMBER(MATCH(DATE($A$7,INT((COLUMN()-1)/31.001)+1,ROUNDUP(MOD(COLUMN()-1,31.001),0)),Feriados,0))),(VLOOKUP(VLOOKUP(WEEKDAY(DATE($A$7,INT((COLUMN()-1)/31.001)+1,ROUNDUP(MOD(COLUMN()-1,31.001),0)),2),Auxiliar!$D$1:$E$7,2,0),'Feriados y días laborables'!$E$5:$F$11,2,0)=\"Si\"))","v":true},{"$f":"AND(NOT(ISNUMBER(MATCH(DATE($A$7,INT((COLUMN()-1)/31.001)+1,ROUNDUP(MOD(COLUMN()-1,31.001),0)),Feriados,0))),(VLOOKUP(VLOOKUP(WEEKDAY(DATE($A$7,INT((COLUMN()-1)/31.001)+1,ROUNDUP(MOD(COLUMN()-1,31.001),0)),2),Auxiliar!$D$1:$E$7,2,0),'Feriados y días laborables'!$E$5:$F$11,2,0)=\"Si\"))","v":true},{"$f":"AND(NOT(ISNUMBER(MATCH(DATE($A$7,INT((COLUMN()-1)/31.001)+1,ROUNDUP(MOD(COLUMN()-1,31.001),0)),Feriados,0))),(VLOOKUP(VLOOKUP(WEEKDAY(DATE($A$7,INT((COLUMN()-1)/31.001)+1,ROUNDUP(MOD(COLUMN()-1,31.001),0)),2),Auxiliar!$D$1:$E$7,2,0),'Feriados y días laborables'!$E$5:$F$11,2,0)=\"Si\"))","v":true},{"$f":"AND(NOT(ISNUMBER(MATCH(DATE($A$7,INT((COLUMN()-1)/31.001)+1,ROUNDUP(MOD(COLUMN()-1,31.001),0)),Feriados,0))),(VLOOKUP(VLOOKUP(WEEKDAY(DATE($A$7,INT((COLUMN()-1)/31.001)+1,ROUNDUP(MOD(COLUMN()-1,31.001),0)),2),Auxiliar!$D$1:$E$7,2,0),'Feriados y días laborables'!$E$5:$F$11,2,0)=\"Si\"))","v":true},{"$f":"AND(NOT(ISNUMBER(MATCH(DATE($A$7,INT((COLUMN()-1)/31.001)+1,ROUNDUP(MOD(COLUMN()-1,31.001),0)),Feriados,0))),(VLOOKUP(VLOOKUP(WEEKDAY(DATE($A$7,INT((COLUMN()-1)/31.001)+1,ROUNDUP(MOD(COLUMN()-1,31.001),0)),2),Auxiliar!$D$1:$E$7,2,0),'Feriados y días laborables'!$E$5:$F$11,2,0)=\"Si\"))","v":true},{"$f":"AND(NOT(ISNUMBER(MATCH(DATE($A$7,INT((COLUMN()-1)/31.001)+1,ROUNDUP(MOD(COLUMN()-1,31.001),0)),Feriados,0))),(VLOOKUP(VLOOKUP(WEEKDAY(DATE($A$7,INT((COLUMN()-1)/31.001)+1,ROUNDUP(MOD(COLUMN()-1,31.001),0)),2),Auxiliar!$D$1:$E$7,2,0),'Feriados y días laborables'!$E$5:$F$11,2,0)=\"Si\"))","v":false},{"$f":"AND(NOT(ISNUMBER(MATCH(DATE($A$7,INT((COLUMN()-1)/31.001)+1,ROUNDUP(MOD(COLUMN()-1,31.001),0)),Feriados,0))),(VLOOKUP(VLOOKUP(WEEKDAY(DATE($A$7,INT((COLUMN()-1)/31.001)+1,ROUNDUP(MOD(COLUMN()-1,31.001),0)),2),Auxiliar!$D$1:$E$7,2,0),'Feriados y días laborables'!$E$5:$F$11,2,0)=\"Si\"))","v":false},{"$f":"AND(NOT(ISNUMBER(MATCH(DATE($A$7,INT((COLUMN()-1)/31.001)+1,ROUNDUP(MOD(COLUMN()-1,31.001),0)),Feriados,0))),(VLOOKUP(VLOOKUP(WEEKDAY(DATE($A$7,INT((COLUMN()-1)/31.001)+1,ROUNDUP(MOD(COLUMN()-1,31.001),0)),2),Auxiliar!$D$1:$E$7,2,0),'Feriados y días laborables'!$E$5:$F$11,2,0)=\"Si\"))","v":true},{"$f":"AND(NOT(ISNUMBER(MATCH(DATE($A$7,INT((COLUMN()-1)/31.001)+1,ROUNDUP(MOD(COLUMN()-1,31.001),0)),Feriados,0))),(VLOOKUP(VLOOKUP(WEEKDAY(DATE($A$7,INT((COLUMN()-1)/31.001)+1,ROUNDUP(MOD(COLUMN()-1,31.001),0)),2),Auxiliar!$D$1:$E$7,2,0),'Feriados y días laborables'!$E$5:$F$11,2,0)=\"Si\"))","v":true},{"$f":"AND(NOT(ISNUMBER(MATCH(DATE($A$7,INT((COLUMN()-1)/31.001)+1,ROUNDUP(MOD(COLUMN()-1,31.001),0)),Feriados,0))),(VLOOKUP(VLOOKUP(WEEKDAY(DATE($A$7,INT((COLUMN()-1)/31.001)+1,ROUNDUP(MOD(COLUMN()-1,31.001),0)),2),Auxiliar!$D$1:$E$7,2,0),'Feriados y días laborables'!$E$5:$F$11,2,0)=\"Si\"))","v":true},{"$f":"AND(NOT(ISNUMBER(MATCH(DATE($A$7,INT((COLUMN()-1)/31.001)+1,ROUNDUP(MOD(COLUMN()-1,31.001),0)),Feriados,0))),(VLOOKUP(VLOOKUP(WEEKDAY(DATE($A$7,INT((COLUMN()-1)/31.001)+1,ROUNDUP(MOD(COLUMN()-1,31.001),0)),2),Auxiliar!$D$1:$E$7,2,0),'Feriados y días laborables'!$E$5:$F$11,2,0)=\"Si\"))","v":true},{"$f":"AND(NOT(ISNUMBER(MATCH(DATE($A$7,INT((COLUMN()-1)/31.001)+1,ROUNDUP(MOD(COLUMN()-1,31.001),0)),Feriados,0))),(VLOOKUP(VLOOKUP(WEEKDAY(DATE($A$7,INT((COLUMN()-1)/31.001)+1,ROUNDUP(MOD(COLUMN()-1,31.001),0)),2),Auxiliar!$D$1:$E$7,2,0),'Feriados y días laborables'!$E$5:$F$11,2,0)=\"Si\"))","v":true},{"$f":"AND(NOT(ISNUMBER(MATCH(DATE($A$7,INT((COLUMN()-1)/31.001)+1,ROUNDUP(MOD(COLUMN()-1,31.001),0)),Feriados,0))),(VLOOKUP(VLOOKUP(WEEKDAY(DATE($A$7,INT((COLUMN()-1)/31.001)+1,ROUNDUP(MOD(COLUMN()-1,31.001),0)),2),Auxiliar!$D$1:$E$7,2,0),'Feriados y días laborables'!$E$5:$F$11,2,0)=\"Si\"))","v":false},{"$f":"AND(NOT(ISNUMBER(MATCH(DATE($A$7,INT((COLUMN()-1)/31.001)+1,ROUNDUP(MOD(COLUMN()-1,31.001),0)),Feriados,0))),(VLOOKUP(VLOOKUP(WEEKDAY(DATE($A$7,INT((COLUMN()-1)/31.001)+1,ROUNDUP(MOD(COLUMN()-1,31.001),0)),2),Auxiliar!$D$1:$E$7,2,0),'Feriados y días laborables'!$E$5:$F$11,2,0)=\"Si\"))","v":false},{"$f":"AND(NOT(ISNUMBER(MATCH(DATE($A$7,INT((COLUMN()-1)/31.001)+1,ROUNDUP(MOD(COLUMN()-1,31.001),0)),Feriados,0))),(VLOOKUP(VLOOKUP(WEEKDAY(DATE($A$7,INT((COLUMN()-1)/31.001)+1,ROUNDUP(MOD(COLUMN()-1,31.001),0)),2),Auxiliar!$D$1:$E$7,2,0),'Feriados y días laborables'!$E$5:$F$11,2,0)=\"Si\"))","v":true},{"$f":"AND(NOT(ISNUMBER(MATCH(DATE($A$7,INT((COLUMN()-1)/31.001)+1,ROUNDUP(MOD(COLUMN()-1,31.001),0)),Feriados,0))),(VLOOKUP(VLOOKUP(WEEKDAY(DATE($A$7,INT((COLUMN()-1)/31.001)+1,ROUNDUP(MOD(COLUMN()-1,31.001),0)),2),Auxiliar!$D$1:$E$7,2,0),'Feriados y días laborables'!$E$5:$F$11,2,0)=\"Si\"))","v":true},{"$f":"AND(NOT(ISNUMBER(MATCH(DATE($A$7,INT((COLUMN()-1)/31.001)+1,ROUNDUP(MOD(COLUMN()-1,31.001),0)),Feriados,0))),(VLOOKUP(VLOOKUP(WEEKDAY(DATE($A$7,INT((COLUMN()-1)/31.001)+1,ROUNDUP(MOD(COLUMN()-1,31.001),0)),2),Auxiliar!$D$1:$E$7,2,0),'Feriados y días laborables'!$E$5:$F$11,2,0)=\"Si\"))","v":true},{"$f":"AND(NOT(ISNUMBER(MATCH(DATE($A$7,INT((COLUMN()-1)/31.001)+1,ROUNDUP(MOD(COLUMN()-1,31.001),0)),Feriados,0))),(VLOOKUP(VLOOKUP(WEEKDAY(DATE($A$7,INT((COLUMN()-1)/31.001)+1,ROUNDUP(MOD(COLUMN()-1,31.001),0)),2),Auxiliar!$D$1:$E$7,2,0),'Feriados y días laborables'!$E$5:$F$11,2,0)=\"Si\"))","v":true},{"$f":"AND(NOT(ISNUMBER(MATCH(DATE($A$7,INT((COLUMN()-1)/31.001)+1,ROUNDUP(MOD(COLUMN()-1,31.001),0)),Feriados,0))),(VLOOKUP(VLOOKUP(WEEKDAY(DATE($A$7,INT((COLUMN()-1)/31.001)+1,ROUNDUP(MOD(COLUMN()-1,31.001),0)),2),Auxiliar!$D$1:$E$7,2,0),'Feriados y días laborables'!$E$5:$F$11,2,0)=\"Si\"))","v":true},{"$f":"AND(NOT(ISNUMBER(MATCH(DATE($A$7,INT((COLUMN()-1)/31.001)+1,ROUNDUP(MOD(COLUMN()-1,31.001),0)),Feriados,0))),(VLOOKUP(VLOOKUP(WEEKDAY(DATE($A$7,INT((COLUMN()-1)/31.001)+1,ROUNDUP(MOD(COLUMN()-1,31.001),0)),2),Auxiliar!$D$1:$E$7,2,0),'Feriados y días laborables'!$E$5:$F$11,2,0)=\"Si\"))","v":false},{"$f":"AND(NOT(ISNUMBER(MATCH(DATE($A$7,INT((COLUMN()-1)/31.001)+1,ROUNDUP(MOD(COLUMN()-1,31.001),0)),Feriados,0))),(VLOOKUP(VLOOKUP(WEEKDAY(DATE($A$7,INT((COLUMN()-1)/31.001)+1,ROUNDUP(MOD(COLUMN()-1,31.001),0)),2),Auxiliar!$D$1:$E$7,2,0),'Feriados y días laborables'!$E$5:$F$11,2,0)=\"Si\"))","v":false},{"$f":"AND(NOT(ISNUMBER(MATCH(DATE($A$7,INT((COLUMN()-1)/31.001)+1,ROUNDUP(MOD(COLUMN()-1,31.001),0)),Feriados,0))),(VLOOKUP(VLOOKUP(WEEKDAY(DATE($A$7,INT((COLUMN()-1)/31.001)+1,ROUNDUP(MOD(COLUMN()-1,31.001),0)),2),Auxiliar!$D$1:$E$7,2,0),'Feriados y días laborables'!$E$5:$F$11,2,0)=\"Si\"))","v":true},{"$f":"AND(NOT(ISNUMBER(MATCH(DATE($A$7,INT((COLUMN()-1)/31.001)+1,ROUNDUP(MOD(COLUMN()-1,31.001),0)),Feriados,0))),(VLOOKUP(VLOOKUP(WEEKDAY(DATE($A$7,INT((COLUMN()-1)/31.001)+1,ROUNDUP(MOD(COLUMN()-1,31.001),0)),2),Auxiliar!$D$1:$E$7,2,0),'Feriados y días laborables'!$E$5:$F$11,2,0)=\"Si\"))","v":true},{"$f":"AND(NOT(ISNUMBER(MATCH(DATE($A$7,INT((COLUMN()-1)/31.001)+1,ROUNDUP(MOD(COLUMN()-1,31.001),0)),Feriados,0))),(VLOOKUP(VLOOKUP(WEEKDAY(DATE($A$7,INT((COLUMN()-1)/31.001)+1,ROUNDUP(MOD(COLUMN()-1,31.001),0)),2),Auxiliar!$D$1:$E$7,2,0),'Feriados y días laborables'!$E$5:$F$11,2,0)=\"Si\"))","v":true},{"$f":"AND(NOT(ISNUMBER(MATCH(DATE($A$7,INT((COLUMN()-1)/31.001)+1,ROUNDUP(MOD(COLUMN()-1,31.001),0)),Feriados,0))),(VLOOKUP(VLOOKUP(WEEKDAY(DATE($A$7,INT((COLUMN()-1)/31.001)+1,ROUNDUP(MOD(COLUMN()-1,31.001),0)),2),Auxiliar!$D$1:$E$7,2,0),'Feriados y días laborables'!$E$5:$F$11,2,0)=\"Si\"))","v":true},{"$f":"AND(NOT(ISNUMBER(MATCH(DATE($A$7,INT((COLUMN()-1)/31.001)+1,ROUNDUP(MOD(COLUMN()-1,31.001),0)),Feriados,0))),(VLOOKUP(VLOOKUP(WEEKDAY(DATE($A$7,INT((COLUMN()-1)/31.001)+1,ROUNDUP(MOD(COLUMN()-1,31.001),0)),2),Auxiliar!$D$1:$E$7,2,0),'Feriados y días laborables'!$E$5:$F$11,2,0)=\"Si\"))","v":true},{"$f":"AND(NOT(ISNUMBER(MATCH(DATE($A$7,INT((COLUMN()-1)/31.001)+1,ROUNDUP(MOD(COLUMN()-1,31.001),0)),Feriados,0))),(VLOOKUP(VLOOKUP(WEEKDAY(DATE($A$7,INT((COLUMN()-1)/31.001)+1,ROUNDUP(MOD(COLUMN()-1,31.001),0)),2),Auxiliar!$D$1:$E$7,2,0),'Feriados y días laborables'!$E$5:$F$11,2,0)=\"Si\"))","v":false},{"$f":"AND(NOT(ISNUMBER(MATCH(DATE($A$7,INT((COLUMN()-1)/31.001)+1,ROUNDUP(MOD(COLUMN()-1,31.001),0)),Feriados,0))),(VLOOKUP(VLOOKUP(WEEKDAY(DATE($A$7,INT((COLUMN()-1)/31.001)+1,ROUNDUP(MOD(COLUMN()-1,31.001),0)),2),Auxiliar!$D$1:$E$7,2,0),'Feriados y días laborables'!$E$5:$F$11,2,0)=\"Si\"))","v":false},{"$f":"AND(NOT(ISNUMBER(MATCH(DATE($A$7,INT((COLUMN()-1)/31.001)+1,ROUNDUP(MOD(COLUMN()-1,31.001),0)),Feriados,0))),(VLOOKUP(VLOOKUP(WEEKDAY(DATE($A$7,INT((COLUMN()-1)/31.001)+1,ROUNDUP(MOD(COLUMN()-1,31.001),0)),2),Auxiliar!$D$1:$E$7,2,0),'Feriados y días laborables'!$E$5:$F$11,2,0)=\"Si\"))","v":true},{"$f":"AND(NOT(ISNUMBER(MATCH(DATE($A$7,INT((COLUMN()-1)/31.001)+1,ROUNDUP(MOD(COLUMN()-1,31.001),0)),Feriados,0))),(VLOOKUP(VLOOKUP(WEEKDAY(DATE($A$7,INT((COLUMN()-1)/31.001)+1,ROUNDUP(MOD(COLUMN()-1,31.001),0)),2),Auxiliar!$D$1:$E$7,2,0),'Feriados y días laborables'!$E$5:$F$11,2,0)=\"Si\"))","v":true},{"$f":"AND(NOT(ISNUMBER(MATCH(DATE($A$7,INT((COLUMN()-1)/31.001)+1,ROUNDUP(MOD(COLUMN()-1,31.001),0)),Feriados,0))),(VLOOKUP(VLOOKUP(WEEKDAY(DATE($A$7,INT((COLUMN()-1)/31.001)+1,ROUNDUP(MOD(COLUMN()-1,31.001),0)),2),Auxiliar!$D$1:$E$7,2,0),'Feriados y días laborables'!$E$5:$F$11,2,0)=\"Si\"))","v":true},{"$f":"AND(NOT(ISNUMBER(MATCH(DATE($A$7,INT((COLUMN()-1)/31.001)+1,ROUNDUP(MOD(COLUMN()-1,31.001),0)),Feriados,0))),(VLOOKUP(VLOOKUP(WEEKDAY(DATE($A$7,INT((COLUMN()-1)/31.001)+1,ROUNDUP(MOD(COLUMN()-1,31.001),0)),2),Auxiliar!$D$1:$E$7,2,0),'Feriados y días laborables'!$E$5:$F$11,2,0)=\"Si\"))","v":true},{"$f":"AND(NOT(ISNUMBER(MATCH(DATE($A$7,INT((COLUMN()-1)/31.001)+1,ROUNDUP(MOD(COLUMN()-1,31.001),0)),Feriados,0))),(VLOOKUP(VLOOKUP(WEEKDAY(DATE($A$7,INT((COLUMN()-1)/31.001)+1,ROUNDUP(MOD(COLUMN()-1,31.001),0)),2),Auxiliar!$D$1:$E$7,2,0),'Feriados y días laborables'!$E$5:$F$11,2,0)=\"Si\"))","v":true},{"$f":"AND(NOT(ISNUMBER(MATCH(DATE($A$7,INT((COLUMN()-1)/31.001)+1,ROUNDUP(MOD(COLUMN()-1,31.001),0)),Feriados,0))),(VLOOKUP(VLOOKUP(WEEKDAY(DATE($A$7,INT((COLUMN()-1)/31.001)+1,ROUNDUP(MOD(COLUMN()-1,31.001),0)),2),Auxiliar!$D$1:$E$7,2,0),'Feriados y días laborables'!$E$5:$F$11,2,0)=\"Si\"))","v":false},{"$f":"AND(NOT(ISNUMBER(MATCH(DATE($A$7,INT((COLUMN()-1)/31.001)+1,ROUNDUP(MOD(COLUMN()-1,31.001),0)),Feriados,0))),(VLOOKUP(VLOOKUP(WEEKDAY(DATE($A$7,INT((COLUMN()-1)/31.001)+1,ROUNDUP(MOD(COLUMN()-1,31.001),0)),2),Auxiliar!$D$1:$E$7,2,0),'Feriados y días laborables'!$E$5:$F$11,2,0)=\"Si\"))","v":false},{"$f":"AND(NOT(ISNUMBER(MATCH(DATE($A$7,INT((COLUMN()-1)/31.001)+1,ROUNDUP(MOD(COLUMN()-1,31.001),0)),Feriados,0))),(VLOOKUP(VLOOKUP(WEEKDAY(DATE($A$7,INT((COLUMN()-1)/31.001)+1,ROUNDUP(MOD(COLUMN()-1,31.001),0)),2),Auxiliar!$D$1:$E$7,2,0),'Feriados y días laborables'!$E$5:$F$11,2,0)=\"Si\"))","v":true},{"$f":"AND(NOT(ISNUMBER(MATCH(DATE($A$7,INT((COLUMN()-1)/31.001)+1,ROUNDUP(MOD(COLUMN()-1,31.001),0)),Feriados,0))),(VLOOKUP(VLOOKUP(WEEKDAY(DATE($A$7,INT((COLUMN()-1)/31.001)+1,ROUNDUP(MOD(COLUMN()-1,31.001),0)),2),Auxiliar!$D$1:$E$7,2,0),'Feriados y días laborables'!$E$5:$F$11,2,0)=\"Si\"))","v":true},{"$f":"AND(NOT(ISNUMBER(MATCH(DATE($A$7,INT((COLUMN()-1)/31.001)+1,ROUNDUP(MOD(COLUMN()-1,31.001),0)),Feriados,0))),(VLOOKUP(VLOOKUP(WEEKDAY(DATE($A$7,INT((COLUMN()-1)/31.001)+1,ROUNDUP(MOD(COLUMN()-1,31.001),0)),2),Auxiliar!$D$1:$E$7,2,0),'Feriados y días laborables'!$E$5:$F$11,2,0)=\"Si\"))","v":true},{"$f":"AND(NOT(ISNUMBER(MATCH(DATE($A$7,INT((COLUMN()-1)/31.001)+1,ROUNDUP(MOD(COLUMN()-1,31.001),0)),Feriados,0))),(VLOOKUP(VLOOKUP(WEEKDAY(DATE($A$7,INT((COLUMN()-1)/31.001)+1,ROUNDUP(MOD(COLUMN()-1,31.001),0)),2),Auxiliar!$D$1:$E$7,2,0),'Feriados y días laborables'!$E$5:$F$11,2,0)=\"Si\"))","v":true},{"$f":"AND(NOT(ISNUMBER(MATCH(DATE($A$7,INT((COLUMN()-1)/31.001)+1,ROUNDUP(MOD(COLUMN()-1,31.001),0)),Feriados,0))),(VLOOKUP(VLOOKUP(WEEKDAY(DATE($A$7,INT((COLUMN()-1)/31.001)+1,ROUNDUP(MOD(COLUMN()-1,31.001),0)),2),Auxiliar!$D$1:$E$7,2,0),'Feriados y días laborables'!$E$5:$F$11,2,0)=\"Si\"))","v":true},{"$f":"AND(NOT(ISNUMBER(MATCH(DATE($A$7,INT((COLUMN()-1)/31.001)+1,ROUNDUP(MOD(COLUMN()-1,31.001),0)),Feriados,0))),(VLOOKUP(VLOOKUP(WEEKDAY(DATE($A$7,INT((COLUMN()-1)/31.001)+1,ROUNDUP(MOD(COLUMN()-1,31.001),0)),2),Auxiliar!$D$1:$E$7,2,0),'Feriados y días laborables'!$E$5:$F$11,2,0)=\"Si\"))","v":false},{"$f":"AND(NOT(ISNUMBER(MATCH(DATE($A$7,INT((COLUMN()-1)/31.001)+1,ROUNDUP(MOD(COLUMN()-1,31.001),0)),Feriados,0))),(VLOOKUP(VLOOKUP(WEEKDAY(DATE($A$7,INT((COLUMN()-1)/31.001)+1,ROUNDUP(MOD(COLUMN()-1,31.001),0)),2),Auxiliar!$D$1:$E$7,2,0),'Feriados y días laborables'!$E$5:$F$11,2,0)=\"Si\"))","v":false},{"$f":"AND(NOT(ISNUMBER(MATCH(DATE($A$7,INT((COLUMN()-1)/31.001)+1,ROUNDUP(MOD(COLUMN()-1,31.001),0)),Feriados,0))),(VLOOKUP(VLOOKUP(WEEKDAY(DATE($A$7,INT((COLUMN()-1)/31.001)+1,ROUNDUP(MOD(COLUMN()-1,31.001),0)),2),Auxiliar!$D$1:$E$7,2,0),'Feriados y días laborables'!$E$5:$F$11,2,0)=\"Si\"))","v":true},{"$f":"AND(NOT(ISNUMBER(MATCH(DATE($A$7,INT((COLUMN()-1)/31.001)+1,ROUNDUP(MOD(COLUMN()-1,31.001),0)),Feriados,0))),(VLOOKUP(VLOOKUP(WEEKDAY(DATE($A$7,INT((COLUMN()-1)/31.001)+1,ROUNDUP(MOD(COLUMN()-1,31.001),0)),2),Auxiliar!$D$1:$E$7,2,0),'Feriados y días laborables'!$E$5:$F$11,2,0)=\"Si\"))","v":true},{"$f":"AND(NOT(ISNUMBER(MATCH(DATE($A$7,INT((COLUMN()-1)/31.001)+1,ROUNDUP(MOD(COLUMN()-1,31.001),0)),Feriados,0))),(VLOOKUP(VLOOKUP(WEEKDAY(DATE($A$7,INT((COLUMN()-1)/31.001)+1,ROUNDUP(MOD(COLUMN()-1,31.001),0)),2),Auxiliar!$D$1:$E$7,2,0),'Feriados y días laborables'!$E$5:$F$11,2,0)=\"Si\"))","v":true},{"$f":"AND(NOT(ISNUMBER(MATCH(DATE($A$7,INT((COLUMN()-1)/31.001)+1,ROUNDUP(MOD(COLUMN()-1,31.001),0)),Feriados,0))),(VLOOKUP(VLOOKUP(WEEKDAY(DATE($A$7,INT((COLUMN()-1)/31.001)+1,ROUNDUP(MOD(COLUMN()-1,31.001),0)),2),Auxiliar!$D$1:$E$7,2,0),'Feriados y días laborables'!$E$5:$F$11,2,0)=\"Si\"))","v":true},{"$f":"AND(NOT(ISNUMBER(MATCH(DATE($A$7,INT((COLUMN()-1)/31.001)+1,ROUNDUP(MOD(COLUMN()-1,31.001),0)),Feriados,0))),(VLOOKUP(VLOOKUP(WEEKDAY(DATE($A$7,INT((COLUMN()-1)/31.001)+1,ROUNDUP(MOD(COLUMN()-1,31.001),0)),2),Auxiliar!$D$1:$E$7,2,0),'Feriados y días laborables'!$E$5:$F$11,2,0)=\"Si\"))","v":true},{"$f":"AND(NOT(ISNUMBER(MATCH(DATE($A$7,INT((COLUMN()-1)/31.001)+1,ROUNDUP(MOD(COLUMN()-1,31.001),0)),Feriados,0))),(VLOOKUP(VLOOKUP(WEEKDAY(DATE($A$7,INT((COLUMN()-1)/31.001)+1,ROUNDUP(MOD(COLUMN()-1,31.001),0)),2),Auxiliar!$D$1:$E$7,2,0),'Feriados y días laborables'!$E$5:$F$11,2,0)=\"Si\"))","v":false},{"$f":"AND(NOT(ISNUMBER(MATCH(DATE($A$7,INT((COLUMN()-1)/31.001)+1,ROUNDUP(MOD(COLUMN()-1,31.001),0)),Feriados,0))),(VLOOKUP(VLOOKUP(WEEKDAY(DATE($A$7,INT((COLUMN()-1)/31.001)+1,ROUNDUP(MOD(COLUMN()-1,31.001),0)),2),Auxiliar!$D$1:$E$7,2,0),'Feriados y días laborables'!$E$5:$F$11,2,0)=\"Si\"))","v":false},{"$f":"AND(NOT(ISNUMBER(MATCH(DATE($A$7,INT((COLUMN()-1)/31.001)+1,ROUNDUP(MOD(COLUMN()-1,31.001),0)),Feriados,0))),(VLOOKUP(VLOOKUP(WEEKDAY(DATE($A$7,INT((COLUMN()-1)/31.001)+1,ROUNDUP(MOD(COLUMN()-1,31.001),0)),2),Auxiliar!$D$1:$E$7,2,0),'Feriados y días laborables'!$E$5:$F$11,2,0)=\"Si\"))","v":true},{"$f":"AND(NOT(ISNUMBER(MATCH(DATE($A$7,INT((COLUMN()-1)/31.001)+1,ROUNDUP(MOD(COLUMN()-1,31.001),0)),Feriados,0))),(VLOOKUP(VLOOKUP(WEEKDAY(DATE($A$7,INT((COLUMN()-1)/31.001)+1,ROUNDUP(MOD(COLUMN()-1,31.001),0)),2),Auxiliar!$D$1:$E$7,2,0),'Feriados y días laborables'!$E$5:$F$11,2,0)=\"Si\"))","v":true},{"$f":"AND(NOT(ISNUMBER(MATCH(DATE($A$7,INT((COLUMN()-1)/31.001)+1,ROUNDUP(MOD(COLUMN()-1,31.001),0)),Feriados,0))),(VLOOKUP(VLOOKUP(WEEKDAY(DATE($A$7,INT((COLUMN()-1)/31.001)+1,ROUNDUP(MOD(COLUMN()-1,31.001),0)),2),Auxiliar!$D$1:$E$7,2,0),'Feriados y días laborables'!$E$5:$F$11,2,0)=\"Si\"))","v":true},{"$f":"AND(NOT(ISNUMBER(MATCH(DATE($A$7,INT((COLUMN()-1)/31.001)+1,ROUNDUP(MOD(COLUMN()-1,31.001),0)),Feriados,0))),(VLOOKUP(VLOOKUP(WEEKDAY(DATE($A$7,INT((COLUMN()-1)/31.001)+1,ROUNDUP(MOD(COLUMN()-1,31.001),0)),2),Auxiliar!$D$1:$E$7,2,0),'Feriados y días laborables'!$E$5:$F$11,2,0)=\"Si\"))","v":true},{"$f":"AND(NOT(ISNUMBER(MATCH(DATE($A$7,INT((COLUMN()-1)/31.001)+1,ROUNDUP(MOD(COLUMN()-1,31.001),0)),Feriados,0))),(VLOOKUP(VLOOKUP(WEEKDAY(DATE($A$7,INT((COLUMN()-1)/31.001)+1,ROUNDUP(MOD(COLUMN()-1,31.001),0)),2),Auxiliar!$D$1:$E$7,2,0),'Feriados y días laborables'!$E$5:$F$11,2,0)=\"Si\"))","v":true},{"$f":"AND(NOT(ISNUMBER(MATCH(DATE($A$7,INT((COLUMN()-1)/31.001)+1,ROUNDUP(MOD(COLUMN()-1,31.001),0)),Feriados,0))),(VLOOKUP(VLOOKUP(WEEKDAY(DATE($A$7,INT((COLUMN()-1)/31.001)+1,ROUNDUP(MOD(COLUMN()-1,31.001),0)),2),Auxiliar!$D$1:$E$7,2,0),'Feriados y días laborables'!$E$5:$F$11,2,0)=\"Si\"))","v":false},{"$f":"AND(NOT(ISNUMBER(MATCH(DATE($A$7,INT((COLUMN()-1)/31.001)+1,ROUNDUP(MOD(COLUMN()-1,31.001),0)),Feriados,0))),(VLOOKUP(VLOOKUP(WEEKDAY(DATE($A$7,INT((COLUMN()-1)/31.001)+1,ROUNDUP(MOD(COLUMN()-1,31.001),0)),2),Auxiliar!$D$1:$E$7,2,0),'Feriados y días laborables'!$E$5:$F$11,2,0)=\"Si\"))","v":false},{"$f":"AND(NOT(ISNUMBER(MATCH(DATE($A$7,INT((COLUMN()-1)/31.001)+1,ROUNDUP(MOD(COLUMN()-1,31.001),0)),Feriados,0))),(VLOOKUP(VLOOKUP(WEEKDAY(DATE($A$7,INT((COLUMN()-1)/31.001)+1,ROUNDUP(MOD(COLUMN()-1,31.001),0)),2),Auxiliar!$D$1:$E$7,2,0),'Feriados y días laborables'!$E$5:$F$11,2,0)=\"Si\"))","v":true},{"$f":"AND(NOT(ISNUMBER(MATCH(DATE($A$7,INT((COLUMN()-1)/31.001)+1,ROUNDUP(MOD(COLUMN()-1,31.001),0)),Feriados,0))),(VLOOKUP(VLOOKUP(WEEKDAY(DATE($A$7,INT((COLUMN()-1)/31.001)+1,ROUNDUP(MOD(COLUMN()-1,31.001),0)),2),Auxiliar!$D$1:$E$7,2,0),'Feriados y días laborables'!$E$5:$F$11,2,0)=\"Si\"))","v":true},{"$f":"AND(NOT(ISNUMBER(MATCH(DATE($A$7,INT((COLUMN()-1)/31.001)+1,ROUNDUP(MOD(COLUMN()-1,31.001),0)),Feriados,0))),(VLOOKUP(VLOOKUP(WEEKDAY(DATE($A$7,INT((COLUMN()-1)/31.001)+1,ROUNDUP(MOD(COLUMN()-1,31.001),0)),2),Auxiliar!$D$1:$E$7,2,0),'Feriados y días laborables'!$E$5:$F$11,2,0)=\"Si\"))","v":true},{"$f":"AND(NOT(ISNUMBER(MATCH(DATE($A$7,INT((COLUMN()-1)/31.001)+1,ROUNDUP(MOD(COLUMN()-1,31.001),0)),Feriados,0))),(VLOOKUP(VLOOKUP(WEEKDAY(DATE($A$7,INT((COLUMN()-1)/31.001)+1,ROUNDUP(MOD(COLUMN()-1,31.001),0)),2),Auxiliar!$D$1:$E$7,2,0),'Feriados y días laborables'!$E$5:$F$11,2,0)=\"Si\"))","v":true},{"$f":"AND(NOT(ISNUMBER(MATCH(DATE($A$7,INT((COLUMN()-1)/31.001)+1,ROUNDUP(MOD(COLUMN()-1,31.001),0)),Feriados,0))),(VLOOKUP(VLOOKUP(WEEKDAY(DATE($A$7,INT((COLUMN()-1)/31.001)+1,ROUNDUP(MOD(COLUMN()-1,31.001),0)),2),Auxiliar!$D$1:$E$7,2,0),'Feriados y días laborables'!$E$5:$F$11,2,0)=\"Si\"))","v":true},{"$f":"AND(NOT(ISNUMBER(MATCH(DATE($A$7,INT((COLUMN()-1)/31.001)+1,ROUNDUP(MOD(COLUMN()-1,31.001),0)),Feriados,0))),(VLOOKUP(VLOOKUP(WEEKDAY(DATE($A$7,INT((COLUMN()-1)/31.001)+1,ROUNDUP(MOD(COLUMN()-1,31.001),0)),2),Auxiliar!$D$1:$E$7,2,0),'Feriados y días laborables'!$E$5:$F$11,2,0)=\"Si\"))","v":false},{"$f":"AND(NOT(ISNUMBER(MATCH(DATE($A$7,INT((COLUMN()-1)/31.001)+1,ROUNDUP(MOD(COLUMN()-1,31.001),0)),Feriados,0))),(VLOOKUP(VLOOKUP(WEEKDAY(DATE($A$7,INT((COLUMN()-1)/31.001)+1,ROUNDUP(MOD(COLUMN()-1,31.001),0)),2),Auxiliar!$D$1:$E$7,2,0),'Feriados y días laborables'!$E$5:$F$11,2,0)=\"Si\"))","v":false},{"$f":"AND(NOT(ISNUMBER(MATCH(DATE($A$7,INT((COLUMN()-1)/31.001)+1,ROUNDUP(MOD(COLUMN()-1,31.001),0)),Feriados,0))),(VLOOKUP(VLOOKUP(WEEKDAY(DATE($A$7,INT((COLUMN()-1)/31.001)+1,ROUNDUP(MOD(COLUMN()-1,31.001),0)),2),Auxiliar!$D$1:$E$7,2,0),'Feriados y días laborables'!$E$5:$F$11,2,0)=\"Si\"))","v":false},{"$f":"AND(NOT(ISNUMBER(MATCH(DATE($A$7,INT((COLUMN()-1)/31.001)+1,ROUNDUP(MOD(COLUMN()-1,31.001),0)),Feriados,0))),(VLOOKUP(VLOOKUP(WEEKDAY(DATE($A$7,INT((COLUMN()-1)/31.001)+1,ROUNDUP(MOD(COLUMN()-1,31.001),0)),2),Auxiliar!$D$1:$E$7,2,0),'Feriados y días laborables'!$E$5:$F$11,2,0)=\"Si\"))","v":true},{"$f":"AND(NOT(ISNUMBER(MATCH(DATE($A$7,INT((COLUMN()-1)/31.001)+1,ROUNDUP(MOD(COLUMN()-1,31.001),0)),Feriados,0))),(VLOOKUP(VLOOKUP(WEEKDAY(DATE($A$7,INT((COLUMN()-1)/31.001)+1,ROUNDUP(MOD(COLUMN()-1,31.001),0)),2),Auxiliar!$D$1:$E$7,2,0),'Feriados y días laborables'!$E$5:$F$11,2,0)=\"Si\"))","v":true},{"$f":"AND(NOT(ISNUMBER(MATCH(DATE($A$7,INT((COLUMN()-1)/31.001)+1,ROUNDUP(MOD(COLUMN()-1,31.001),0)),Feriados,0))),(VLOOKUP(VLOOKUP(WEEKDAY(DATE($A$7,INT((COLUMN()-1)/31.001)+1,ROUNDUP(MOD(COLUMN()-1,31.001),0)),2),Auxiliar!$D$1:$E$7,2,0),'Feriados y días laborables'!$E$5:$F$11,2,0)=\"Si\"))","v":true},{"$f":"AND(NOT(ISNUMBER(MATCH(DATE($A$7,INT((COLUMN()-1)/31.001)+1,ROUNDUP(MOD(COLUMN()-1,31.001),0)),Feriados,0))),(VLOOKUP(VLOOKUP(WEEKDAY(DATE($A$7,INT((COLUMN()-1)/31.001)+1,ROUNDUP(MOD(COLUMN()-1,31.001),0)),2),Auxiliar!$D$1:$E$7,2,0),'Feriados y días laborables'!$E$5:$F$11,2,0)=\"Si\"))","v":true},{"$f":"AND(NOT(ISNUMBER(MATCH(DATE($A$7,INT((COLUMN()-1)/31.001)+1,ROUNDUP(MOD(COLUMN()-1,31.001),0)),Feriados,0))),(VLOOKUP(VLOOKUP(WEEKDAY(DATE($A$7,INT((COLUMN()-1)/31.001)+1,ROUNDUP(MOD(COLUMN()-1,31.001),0)),2),Auxiliar!$D$1:$E$7,2,0),'Feriados y días laborables'!$E$5:$F$11,2,0)=\"Si\"))","v":true},{"$f":"AND(NOT(ISNUMBER(MATCH(DATE($A$7,INT((COLUMN()-1)/31.001)+1,ROUNDUP(MOD(COLUMN()-1,31.001),0)),Feriados,0))),(VLOOKUP(VLOOKUP(WEEKDAY(DATE($A$7,INT((COLUMN()-1)/31.001)+1,ROUNDUP(MOD(COLUMN()-1,31.001),0)),2),Auxiliar!$D$1:$E$7,2,0),'Feriados y días laborables'!$E$5:$F$11,2,0)=\"Si\"))","v":false},{"$f":"AND(NOT(ISNUMBER(MATCH(DATE($A$7,INT((COLUMN()-1)/31.001)+1,ROUNDUP(MOD(COLUMN()-1,31.001),0)),Feriados,0))),(VLOOKUP(VLOOKUP(WEEKDAY(DATE($A$7,INT((COLUMN()-1)/31.001)+1,ROUNDUP(MOD(COLUMN()-1,31.001),0)),2),Auxiliar!$D$1:$E$7,2,0),'Feriados y días laborables'!$E$5:$F$11,2,0)=\"Si\"))","v":false},{"$f":"AND(NOT(ISNUMBER(MATCH(DATE($A$7,INT((COLUMN()-1)/31.001)+1,ROUNDUP(MOD(COLUMN()-1,31.001),0)),Feriados,0))),(VLOOKUP(VLOOKUP(WEEKDAY(DATE($A$7,INT((COLUMN()-1)/31.001)+1,ROUNDUP(MOD(COLUMN()-1,31.001),0)),2),Auxiliar!$D$1:$E$7,2,0),'Feriados y días laborables'!$E$5:$F$11,2,0)=\"Si\"))","v":true},{"$f":"AND(NOT(ISNUMBER(MATCH(DATE($A$7,INT((COLUMN()-1)/31.001)+1,ROUNDUP(MOD(COLUMN()-1,31.001),0)),Feriados,0))),(VLOOKUP(VLOOKUP(WEEKDAY(DATE($A$7,INT((COLUMN()-1)/31.001)+1,ROUNDUP(MOD(COLUMN()-1,31.001),0)),2),Auxiliar!$D$1:$E$7,2,0),'Feriados y días laborables'!$E$5:$F$11,2,0)=\"Si\"))","v":true},{"$f":"AND(NOT(ISNUMBER(MATCH(DATE($A$7,INT((COLUMN()-1)/31.001)+1,ROUNDUP(MOD(COLUMN()-1,31.001),0)),Feriados,0))),(VLOOKUP(VLOOKUP(WEEKDAY(DATE($A$7,INT((COLUMN()-1)/31.001)+1,ROUNDUP(MOD(COLUMN()-1,31.001),0)),2),Auxiliar!$D$1:$E$7,2,0),'Feriados y días laborables'!$E$5:$F$11,2,0)=\"Si\"))","v":true},{"$f":"AND(NOT(ISNUMBER(MATCH(DATE($A$7,INT((COLUMN()-1)/31.001)+1,ROUNDUP(MOD(COLUMN()-1,31.001),0)),Feriados,0))),(VLOOKUP(VLOOKUP(WEEKDAY(DATE($A$7,INT((COLUMN()-1)/31.001)+1,ROUNDUP(MOD(COLUMN()-1,31.001),0)),2),Auxiliar!$D$1:$E$7,2,0),'Feriados y días laborables'!$E$5:$F$11,2,0)=\"Si\"))","v":true},{"$f":"AND(NOT(ISNUMBER(MATCH(DATE($A$7,INT((COLUMN()-1)/31.001)+1,ROUNDUP(MOD(COLUMN()-1,31.001),0)),Feriados,0))),(VLOOKUP(VLOOKUP(WEEKDAY(DATE($A$7,INT((COLUMN()-1)/31.001)+1,ROUNDUP(MOD(COLUMN()-1,31.001),0)),2),Auxiliar!$D$1:$E$7,2,0),'Feriados y días laborables'!$E$5:$F$11,2,0)=\"Si\"))","v":true},{"$f":"AND(NOT(ISNUMBER(MATCH(DATE($A$7,INT((COLUMN()-1)/31.001)+1,ROUNDUP(MOD(COLUMN()-1,31.001),0)),Feriados,0))),(VLOOKUP(VLOOKUP(WEEKDAY(DATE($A$7,INT((COLUMN()-1)/31.001)+1,ROUNDUP(MOD(COLUMN()-1,31.001),0)),2),Auxiliar!$D$1:$E$7,2,0),'Feriados y días laborables'!$E$5:$F$11,2,0)=\"Si\"))","v":false},{"$f":"AND(NOT(ISNUMBER(MATCH(DATE($A$7,INT((COLUMN()-1)/31.001)+1,ROUNDUP(MOD(COLUMN()-1,31.001),0)),Feriados,0))),(VLOOKUP(VLOOKUP(WEEKDAY(DATE($A$7,INT((COLUMN()-1)/31.001)+1,ROUNDUP(MOD(COLUMN()-1,31.001),0)),2),Auxiliar!$D$1:$E$7,2,0),'Feriados y días laborables'!$E$5:$F$11,2,0)=\"Si\"))","v":false},{"$f":"AND(NOT(ISNUMBER(MATCH(DATE($A$7,INT((COLUMN()-1)/31.001)+1,ROUNDUP(MOD(COLUMN()-1,31.001),0)),Feriados,0))),(VLOOKUP(VLOOKUP(WEEKDAY(DATE($A$7,INT((COLUMN()-1)/31.001)+1,ROUNDUP(MOD(COLUMN()-1,31.001),0)),2),Auxiliar!$D$1:$E$7,2,0),'Feriados y días laborables'!$E$5:$F$11,2,0)=\"Si\"))","v":true},{"$f":"AND(NOT(ISNUMBER(MATCH(DATE($A$7,INT((COLUMN()-1)/31.001)+1,ROUNDUP(MOD(COLUMN()-1,31.001),0)),Feriados,0))),(VLOOKUP(VLOOKUP(WEEKDAY(DATE($A$7,INT((COLUMN()-1)/31.001)+1,ROUNDUP(MOD(COLUMN()-1,31.001),0)),2),Auxiliar!$D$1:$E$7,2,0),'Feriados y días laborables'!$E$5:$F$11,2,0)=\"Si\"))","v":true},{"$f":"AND(NOT(ISNUMBER(MATCH(DATE($A$7,INT((COLUMN()-1)/31.001)+1,ROUNDUP(MOD(COLUMN()-1,31.001),0)),Feriados,0))),(VLOOKUP(VLOOKUP(WEEKDAY(DATE($A$7,INT((COLUMN()-1)/31.001)+1,ROUNDUP(MOD(COLUMN()-1,31.001),0)),2),Auxiliar!$D$1:$E$7,2,0),'Feriados y días laborables'!$E$5:$F$11,2,0)=\"Si\"))","v":true},{"$f":"AND(NOT(ISNUMBER(MATCH(DATE($A$7,INT((COLUMN()-1)/31.001)+1,ROUNDUP(MOD(COLUMN()-1,31.001),0)),Feriados,0))),(VLOOKUP(VLOOKUP(WEEKDAY(DATE($A$7,INT((COLUMN()-1)/31.001)+1,ROUNDUP(MOD(COLUMN()-1,31.001),0)),2),Auxiliar!$D$1:$E$7,2,0),'Feriados y días laborables'!$E$5:$F$11,2,0)=\"Si\"))","v":true},{"$f":"AND(NOT(ISNUMBER(MATCH(DATE($A$7,INT((COLUMN()-1)/31.001)+1,ROUNDUP(MOD(COLUMN()-1,31.001),0)),Feriados,0))),(VLOOKUP(VLOOKUP(WEEKDAY(DATE($A$7,INT((COLUMN()-1)/31.001)+1,ROUNDUP(MOD(COLUMN()-1,31.001),0)),2),Auxiliar!$D$1:$E$7,2,0),'Feriados y días laborables'!$E$5:$F$11,2,0)=\"Si\"))","v":true},{"$f":"AND(NOT(ISNUMBER(MATCH(DATE($A$7,INT((COLUMN()-1)/31.001)+1,ROUNDUP(MOD(COLUMN()-1,31.001),0)),Feriados,0))),(VLOOKUP(VLOOKUP(WEEKDAY(DATE($A$7,INT((COLUMN()-1)/31.001)+1,ROUNDUP(MOD(COLUMN()-1,31.001),0)),2),Auxiliar!$D$1:$E$7,2,0),'Feriados y días laborables'!$E$5:$F$11,2,0)=\"Si\"))","v":false},{"$f":"AND(NOT(ISNUMBER(MATCH(DATE($A$7,INT((COLUMN()-1)/31.001)+1,ROUNDUP(MOD(COLUMN()-1,31.001),0)),Feriados,0))),(VLOOKUP(VLOOKUP(WEEKDAY(DATE($A$7,INT((COLUMN()-1)/31.001)+1,ROUNDUP(MOD(COLUMN()-1,31.001),0)),2),Auxiliar!$D$1:$E$7,2,0),'Feriados y días laborables'!$E$5:$F$11,2,0)=\"Si\"))","v":false},{"$f":"AND(NOT(ISNUMBER(MATCH(DATE($A$7,INT((COLUMN()-1)/31.001)+1,ROUNDUP(MOD(COLUMN()-1,31.001),0)),Feriados,0))),(VLOOKUP(VLOOKUP(WEEKDAY(DATE($A$7,INT((COLUMN()-1)/31.001)+1,ROUNDUP(MOD(COLUMN()-1,31.001),0)),2),Auxiliar!$D$1:$E$7,2,0),'Feriados y días laborables'!$E$5:$F$11,2,0)=\"Si\"))","v":true},{"$f":"AND(NOT(ISNUMBER(MATCH(DATE($A$7,INT((COLUMN()-1)/31.001)+1,ROUNDUP(MOD(COLUMN()-1,31.001),0)),Feriados,0))),(VLOOKUP(VLOOKUP(WEEKDAY(DATE($A$7,INT((COLUMN()-1)/31.001)+1,ROUNDUP(MOD(COLUMN()-1,31.001),0)),2),Auxiliar!$D$1:$E$7,2,0),'Feriados y días laborables'!$E$5:$F$11,2,0)=\"Si\"))","v":true},{"$f":"AND(NOT(ISNUMBER(MATCH(DATE($A$7,INT((COLUMN()-1)/31.001)+1,ROUNDUP(MOD(COLUMN()-1,31.001),0)),Feriados,0))),(VLOOKUP(VLOOKUP(WEEKDAY(DATE($A$7,INT((COLUMN()-1)/31.001)+1,ROUNDUP(MOD(COLUMN()-1,31.001),0)),2),Auxiliar!$D$1:$E$7,2,0),'Feriados y días laborables'!$E$5:$F$11,2,0)=\"Si\"))","v":true},{"$f":"AND(NOT(ISNUMBER(MATCH(DATE($A$7,INT((COLUMN()-1)/31.001)+1,ROUNDUP(MOD(COLUMN()-1,31.001),0)),Feriados,0))),(VLOOKUP(VLOOKUP(WEEKDAY(DATE($A$7,INT((COLUMN()-1)/31.001)+1,ROUNDUP(MOD(COLUMN()-1,31.001),0)),2),Auxiliar!$D$1:$E$7,2,0),'Feriados y días laborables'!$E$5:$F$11,2,0)=\"Si\"))","v":true},{"$f":"AND(NOT(ISNUMBER(MATCH(DATE($A$7,INT((COLUMN()-1)/31.001)+1,ROUNDUP(MOD(COLUMN()-1,31.001),0)),Feriados,0))),(VLOOKUP(VLOOKUP(WEEKDAY(DATE($A$7,INT((COLUMN()-1)/31.001)+1,ROUNDUP(MOD(COLUMN()-1,31.001),0)),2),Auxiliar!$D$1:$E$7,2,0),'Feriados y días laborables'!$E$5:$F$11,2,0)=\"Si\"))","v":true},{"$f":"AND(NOT(ISNUMBER(MATCH(DATE($A$7,INT((COLUMN()-1)/31.001)+1,ROUNDUP(MOD(COLUMN()-1,31.001),0)),Feriados,0))),(VLOOKUP(VLOOKUP(WEEKDAY(DATE($A$7,INT((COLUMN()-1)/31.001)+1,ROUNDUP(MOD(COLUMN()-1,31.001),0)),2),Auxiliar!$D$1:$E$7,2,0),'Feriados y días laborables'!$E$5:$F$11,2,0)=\"Si\"))","v":false},{"$f":"AND(NOT(ISNUMBER(MATCH(DATE($A$7,INT((COLUMN()-1)/31.001)+1,ROUNDUP(MOD(COLUMN()-1,31.001),0)),Feriados,0))),(VLOOKUP(VLOOKUP(WEEKDAY(DATE($A$7,INT((COLUMN()-1)/31.001)+1,ROUNDUP(MOD(COLUMN()-1,31.001),0)),2),Auxiliar!$D$1:$E$7,2,0),'Feriados y días laborables'!$E$5:$F$11,2,0)=\"Si\"))","v":false},{"$f":"AND(NOT(ISNUMBER(MATCH(DATE($A$7,INT((COLUMN()-1)/31.001)+1,ROUNDUP(MOD(COLUMN()-1,31.001),0)),Feriados,0))),(VLOOKUP(VLOOKUP(WEEKDAY(DATE($A$7,INT((COLUMN()-1)/31.001)+1,ROUNDUP(MOD(COLUMN()-1,31.001),0)),2),Auxiliar!$D$1:$E$7,2,0),'Feriados y días laborables'!$E$5:$F$11,2,0)=\"Si\"))","v":true},{"$f":"AND(NOT(ISNUMBER(MATCH(DATE($A$7,INT((COLUMN()-1)/31.001)+1,ROUNDUP(MOD(COLUMN()-1,31.001),0)),Feriados,0))),(VLOOKUP(VLOOKUP(WEEKDAY(DATE($A$7,INT((COLUMN()-1)/31.001)+1,ROUNDUP(MOD(COLUMN()-1,31.001),0)),2),Auxiliar!$D$1:$E$7,2,0),'Feriados y días laborables'!$E$5:$F$11,2,0)=\"Si\"))","v":true},{"$f":"AND(NOT(ISNUMBER(MATCH(DATE($A$7,INT((COLUMN()-1)/31.001)+1,ROUNDUP(MOD(COLUMN()-1,31.001),0)),Feriados,0))),(VLOOKUP(VLOOKUP(WEEKDAY(DATE($A$7,INT((COLUMN()-1)/31.001)+1,ROUNDUP(MOD(COLUMN()-1,31.001),0)),2),Auxiliar!$D$1:$E$7,2,0),'Feriados y días laborables'!$E$5:$F$11,2,0)=\"Si\"))","v":true},{"$f":"AND(NOT(ISNUMBER(MATCH(DATE($A$7,INT((COLUMN()-1)/31.001)+1,ROUNDUP(MOD(COLUMN()-1,31.001),0)),Feriados,0))),(VLOOKUP(VLOOKUP(WEEKDAY(DATE($A$7,INT((COLUMN()-1)/31.001)+1,ROUNDUP(MOD(COLUMN()-1,31.001),0)),2),Auxiliar!$D$1:$E$7,2,0),'Feriados y días laborables'!$E$5:$F$11,2,0)=\"Si\"))","v":true},{"$f":"AND(NOT(ISNUMBER(MATCH(DATE($A$7,INT((COLUMN()-1)/31.001)+1,ROUNDUP(MOD(COLUMN()-1,31.001),0)),Feriados,0))),(VLOOKUP(VLOOKUP(WEEKDAY(DATE($A$7,INT((COLUMN()-1)/31.001)+1,ROUNDUP(MOD(COLUMN()-1,31.001),0)),2),Auxiliar!$D$1:$E$7,2,0),'Feriados y días laborables'!$E$5:$F$11,2,0)=\"Si\"))","v":true},{"$f":"AND(NOT(ISNUMBER(MATCH(DATE($A$7,INT((COLUMN()-1)/31.001)+1,ROUNDUP(MOD(COLUMN()-1,31.001),0)),Feriados,0))),(VLOOKUP(VLOOKUP(WEEKDAY(DATE($A$7,INT((COLUMN()-1)/31.001)+1,ROUNDUP(MOD(COLUMN()-1,31.001),0)),2),Auxiliar!$D$1:$E$7,2,0),'Feriados y días laborables'!$E$5:$F$11,2,0)=\"Si\"))","v":false},{"$f":"AND(NOT(ISNUMBER(MATCH(DATE($A$7,INT((COLUMN()-1)/31.001)+1,ROUNDUP(MOD(COLUMN()-1,31.001),0)),Feriados,0))),(VLOOKUP(VLOOKUP(WEEKDAY(DATE($A$7,INT((COLUMN()-1)/31.001)+1,ROUNDUP(MOD(COLUMN()-1,31.001),0)),2),Auxiliar!$D$1:$E$7,2,0),'Feriados y días laborables'!$E$5:$F$11,2,0)=\"Si\"))","v":false},{"$f":"AND(NOT(ISNUMBER(MATCH(DATE($A$7,INT((COLUMN()-1)/31.001)+1,ROUNDUP(MOD(COLUMN()-1,31.001),0)),Feriados,0))),(VLOOKUP(VLOOKUP(WEEKDAY(DATE($A$7,INT((COLUMN()-1)/31.001)+1,ROUNDUP(MOD(COLUMN()-1,31.001),0)),2),Auxiliar!$D$1:$E$7,2,0),'Feriados y días laborables'!$E$5:$F$11,2,0)=\"Si\"))","v":true},{"$f":"AND(NOT(ISNUMBER(MATCH(DATE($A$7,INT((COLUMN()-1)/31.001)+1,ROUNDUP(MOD(COLUMN()-1,31.001),0)),Feriados,0))),(VLOOKUP(VLOOKUP(WEEKDAY(DATE($A$7,INT((COLUMN()-1)/31.001)+1,ROUNDUP(MOD(COLUMN()-1,31.001),0)),2),Auxiliar!$D$1:$E$7,2,0),'Feriados y días laborables'!$E$5:$F$11,2,0)=\"Si\"))","v":true},{"$f":"AND(NOT(ISNUMBER(MATCH(DATE($A$7,INT((COLUMN()-1)/31.001)+1,ROUNDUP(MOD(COLUMN()-1,31.001),0)),Feriados,0))),(VLOOKUP(VLOOKUP(WEEKDAY(DATE($A$7,INT((COLUMN()-1)/31.001)+1,ROUNDUP(MOD(COLUMN()-1,31.001),0)),2),Auxiliar!$D$1:$E$7,2,0),'Feriados y días laborables'!$E$5:$F$11,2,0)=\"Si\"))","v":true},{"$f":"AND(NOT(ISNUMBER(MATCH(DATE($A$7,INT((COLUMN()-1)/31.001)+1,ROUNDUP(MOD(COLUMN()-1,31.001),0)),Feriados,0))),(VLOOKUP(VLOOKUP(WEEKDAY(DATE($A$7,INT((COLUMN()-1)/31.001)+1,ROUNDUP(MOD(COLUMN()-1,31.001),0)),2),Auxiliar!$D$1:$E$7,2,0),'Feriados y días laborables'!$E$5:$F$11,2,0)=\"Si\"))","v":true},{"$f":"AND(NOT(ISNUMBER(MATCH(DATE($A$7,INT((COLUMN()-1)/31.001)+1,ROUNDUP(MOD(COLUMN()-1,31.001),0)),Feriados,0))),(VLOOKUP(VLOOKUP(WEEKDAY(DATE($A$7,INT((COLUMN()-1)/31.001)+1,ROUNDUP(MOD(COLUMN()-1,31.001),0)),2),Auxiliar!$D$1:$E$7,2,0),'Feriados y días laborables'!$E$5:$F$11,2,0)=\"Si\"))","v":true},{"$f":"AND(NOT(ISNUMBER(MATCH(DATE($A$7,INT((COLUMN()-1)/31.001)+1,ROUNDUP(MOD(COLUMN()-1,31.001),0)),Feriados,0))),(VLOOKUP(VLOOKUP(WEEKDAY(DATE($A$7,INT((COLUMN()-1)/31.001)+1,ROUNDUP(MOD(COLUMN()-1,31.001),0)),2),Auxiliar!$D$1:$E$7,2,0),'Feriados y días laborables'!$E$5:$F$11,2,0)=\"Si\"))","v":false},{"$f":"AND(NOT(ISNUMBER(MATCH(DATE($A$7,INT((COLUMN()-1)/31.001)+1,ROUNDUP(MOD(COLUMN()-1,31.001),0)),Feriados,0))),(VLOOKUP(VLOOKUP(WEEKDAY(DATE($A$7,INT((COLUMN()-1)/31.001)+1,ROUNDUP(MOD(COLUMN()-1,31.001),0)),2),Auxiliar!$D$1:$E$7,2,0),'Feriados y días laborables'!$E$5:$F$11,2,0)=\"Si\"))","v":false},{"$f":"AND(NOT(ISNUMBER(MATCH(DATE($A$7,INT((COLUMN()-1)/31.001)+1,ROUNDUP(MOD(COLUMN()-1,31.001),0)),Feriados,0))),(VLOOKUP(VLOOKUP(WEEKDAY(DATE($A$7,INT((COLUMN()-1)/31.001)+1,ROUNDUP(MOD(COLUMN()-1,31.001),0)),2),Auxiliar!$D$1:$E$7,2,0),'Feriados y días laborables'!$E$5:$F$11,2,0)=\"Si\"))","v":true},{"$f":"AND(NOT(ISNUMBER(MATCH(DATE($A$7,INT((COLUMN()-1)/31.001)+1,ROUNDUP(MOD(COLUMN()-1,31.001),0)),Feriados,0))),(VLOOKUP(VLOOKUP(WEEKDAY(DATE($A$7,INT((COLUMN()-1)/31.001)+1,ROUNDUP(MOD(COLUMN()-1,31.001),0)),2),Auxiliar!$D$1:$E$7,2,0),'Feriados y días laborables'!$E$5:$F$11,2,0)=\"Si\"))","v":true},{"$f":"AND(NOT(ISNUMBER(MATCH(DATE($A$7,INT((COLUMN()-1)/31.001)+1,ROUNDUP(MOD(COLUMN()-1,31.001),0)),Feriados,0))),(VLOOKUP(VLOOKUP(WEEKDAY(DATE($A$7,INT((COLUMN()-1)/31.001)+1,ROUNDUP(MOD(COLUMN()-1,31.001),0)),2),Auxiliar!$D$1:$E$7,2,0),'Feriados y días laborables'!$E$5:$F$11,2,0)=\"Si\"))","v":true},{"$f":"AND(NOT(ISNUMBER(MATCH(DATE($A$7,INT((COLUMN()-1)/31.001)+1,ROUNDUP(MOD(COLUMN()-1,31.001),0)),Feriados,0))),(VLOOKUP(VLOOKUP(WEEKDAY(DATE($A$7,INT((COLUMN()-1)/31.001)+1,ROUNDUP(MOD(COLUMN()-1,31.001),0)),2),Auxiliar!$D$1:$E$7,2,0),'Feriados y días laborables'!$E$5:$F$11,2,0)=\"Si\"))","v":true},{"$f":"AND(NOT(ISNUMBER(MATCH(DATE($A$7,INT((COLUMN()-1)/31.001)+1,ROUNDUP(MOD(COLUMN()-1,31.001),0)),Feriados,0))),(VLOOKUP(VLOOKUP(WEEKDAY(DATE($A$7,INT((COLUMN()-1)/31.001)+1,ROUNDUP(MOD(COLUMN()-1,31.001),0)),2),Auxiliar!$D$1:$E$7,2,0),'Feriados y días laborables'!$E$5:$F$11,2,0)=\"Si\"))","v":true},{"$f":"AND(NOT(ISNUMBER(MATCH(DATE($A$7,INT((COLUMN()-1)/31.001)+1,ROUNDUP(MOD(COLUMN()-1,31.001),0)),Feriados,0))),(VLOOKUP(VLOOKUP(WEEKDAY(DATE($A$7,INT((COLUMN()-1)/31.001)+1,ROUNDUP(MOD(COLUMN()-1,31.001),0)),2),Auxiliar!$D$1:$E$7,2,0),'Feriados y días laborables'!$E$5:$F$11,2,0)=\"Si\"))","v":false},{"$f":"AND(NOT(ISNUMBER(MATCH(DATE($A$7,INT((COLUMN()-1)/31.001)+1,ROUNDUP(MOD(COLUMN()-1,31.001),0)),Feriados,0))),(VLOOKUP(VLOOKUP(WEEKDAY(DATE($A$7,INT((COLUMN()-1)/31.001)+1,ROUNDUP(MOD(COLUMN()-1,31.001),0)),2),Auxiliar!$D$1:$E$7,2,0),'Feriados y días laborables'!$E$5:$F$11,2,0)=\"Si\"))","v":false},{"$f":"AND(NOT(ISNUMBER(MATCH(DATE($A$7,INT((COLUMN()-1)/31.001)+1,ROUNDUP(MOD(COLUMN()-1,31.001),0)),Feriados,0))),(VLOOKUP(VLOOKUP(WEEKDAY(DATE($A$7,INT((COLUMN()-1)/31.001)+1,ROUNDUP(MOD(COLUMN()-1,31.001),0)),2),Auxiliar!$D$1:$E$7,2,0),'Feriados y días laborables'!$E$5:$F$11,2,0)=\"Si\"))","v":true},{"$f":"AND(NOT(ISNUMBER(MATCH(DATE($A$7,INT((COLUMN()-1)/31.001)+1,ROUNDUP(MOD(COLUMN()-1,31.001),0)),Feriados,0))),(VLOOKUP(VLOOKUP(WEEKDAY(DATE($A$7,INT((COLUMN()-1)/31.001)+1,ROUNDUP(MOD(COLUMN()-1,31.001),0)),2),Auxiliar!$D$1:$E$7,2,0),'Feriados y días laborables'!$E$5:$F$11,2,0)=\"Si\"))","v":true},{"$f":"AND(NOT(ISNUMBER(MATCH(DATE($A$7,INT((COLUMN()-1)/31.001)+1,ROUNDUP(MOD(COLUMN()-1,31.001),0)),Feriados,0))),(VLOOKUP(VLOOKUP(WEEKDAY(DATE($A$7,INT((COLUMN()-1)/31.001)+1,ROUNDUP(MOD(COLUMN()-1,31.001),0)),2),Auxiliar!$D$1:$E$7,2,0),'Feriados y días laborables'!$E$5:$F$11,2,0)=\"Si\"))","v":true},{"$f":"AND(NOT(ISNUMBER(MATCH(DATE($A$7,INT((COLUMN()-1)/31.001)+1,ROUNDUP(MOD(COLUMN()-1,31.001),0)),Feriados,0))),(VLOOKUP(VLOOKUP(WEEKDAY(DATE($A$7,INT((COLUMN()-1)/31.001)+1,ROUNDUP(MOD(COLUMN()-1,31.001),0)),2),Auxiliar!$D$1:$E$7,2,0),'Feriados y días laborables'!$E$5:$F$11,2,0)=\"Si\"))","v":true},{"$f":"AND(NOT(ISNUMBER(MATCH(DATE($A$7,INT((COLUMN()-1)/31.001)+1,ROUNDUP(MOD(COLUMN()-1,31.001),0)),Feriados,0))),(VLOOKUP(VLOOKUP(WEEKDAY(DATE($A$7,INT((COLUMN()-1)/31.001)+1,ROUNDUP(MOD(COLUMN()-1,31.001),0)),2),Auxiliar!$D$1:$E$7,2,0),'Feriados y días laborables'!$E$5:$F$11,2,0)=\"Si\"))","v":true},{"$f":"AND(NOT(ISNUMBER(MATCH(DATE($A$7,INT((COLUMN()-1)/31.001)+1,ROUNDUP(MOD(COLUMN()-1,31.001),0)),Feriados,0))),(VLOOKUP(VLOOKUP(WEEKDAY(DATE($A$7,INT((COLUMN()-1)/31.001)+1,ROUNDUP(MOD(COLUMN()-1,31.001),0)),2),Auxiliar!$D$1:$E$7,2,0),'Feriados y días laborables'!$E$5:$F$11,2,0)=\"Si\"))","v":false},{"$f":"AND(NOT(ISNUMBER(MATCH(DATE($A$7,INT((COLUMN()-1)/31.001)+1,ROUNDUP(MOD(COLUMN()-1,31.001),0)),Feriados,0))),(VLOOKUP(VLOOKUP(WEEKDAY(DATE($A$7,INT((COLUMN()-1)/31.001)+1,ROUNDUP(MOD(COLUMN()-1,31.001),0)),2),Auxiliar!$D$1:$E$7,2,0),'Feriados y días laborables'!$E$5:$F$11,2,0)=\"Si\"))","v":false},{"$f":"AND(NOT(ISNUMBER(MATCH(DATE($A$7,INT((COLUMN()-1)/31.001)+1,ROUNDUP(MOD(COLUMN()-1,31.001),0)),Feriados,0))),(VLOOKUP(VLOOKUP(WEEKDAY(DATE($A$7,INT((COLUMN()-1)/31.001)+1,ROUNDUP(MOD(COLUMN()-1,31.001),0)),2),Auxiliar!$D$1:$E$7,2,0),'Feriados y días laborables'!$E$5:$F$11,2,0)=\"Si\"))","v":true},{"$f":"AND(NOT(ISNUMBER(MATCH(DATE($A$7,INT((COLUMN()-1)/31.001)+1,ROUNDUP(MOD(COLUMN()-1,31.001),0)),Feriados,0))),(VLOOKUP(VLOOKUP(WEEKDAY(DATE($A$7,INT((COLUMN()-1)/31.001)+1,ROUNDUP(MOD(COLUMN()-1,31.001),0)),2),Auxiliar!$D$1:$E$7,2,0),'Feriados y días laborables'!$E$5:$F$11,2,0)=\"Si\"))","v":true},{"$f":"AND(NOT(ISNUMBER(MATCH(DATE($A$7,INT((COLUMN()-1)/31.001)+1,ROUNDUP(MOD(COLUMN()-1,31.001),0)),Feriados,0))),(VLOOKUP(VLOOKUP(WEEKDAY(DATE($A$7,INT((COLUMN()-1)/31.001)+1,ROUNDUP(MOD(COLUMN()-1,31.001),0)),2),Auxiliar!$D$1:$E$7,2,0),'Feriados y días laborables'!$E$5:$F$11,2,0)=\"Si\"))","v":true},{"$f":"AND(NOT(ISNUMBER(MATCH(DATE($A$7,INT((COLUMN()-1)/31.001)+1,ROUNDUP(MOD(COLUMN()-1,31.001),0)),Feriados,0))),(VLOOKUP(VLOOKUP(WEEKDAY(DATE($A$7,INT((COLUMN()-1)/31.001)+1,ROUNDUP(MOD(COLUMN()-1,31.001),0)),2),Auxiliar!$D$1:$E$7,2,0),'Feriados y días laborables'!$E$5:$F$11,2,0)=\"Si\"))","v":true},{"$f":"AND(NOT(ISNUMBER(MATCH(DATE($A$7,INT((COLUMN()-1)/31.001)+1,ROUNDUP(MOD(COLUMN()-1,31.001),0)),Feriados,0))),(VLOOKUP(VLOOKUP(WEEKDAY(DATE($A$7,INT((COLUMN()-1)/31.001)+1,ROUNDUP(MOD(COLUMN()-1,31.001),0)),2),Auxiliar!$D$1:$E$7,2,0),'Feriados y días laborables'!$E$5:$F$11,2,0)=\"Si\"))","v":true},{"$f":"AND(NOT(ISNUMBER(MATCH(DATE($A$7,INT((COLUMN()-1)/31.001)+1,ROUNDUP(MOD(COLUMN()-1,31.001),0)),Feriados,0))),(VLOOKUP(VLOOKUP(WEEKDAY(DATE($A$7,INT((COLUMN()-1)/31.001)+1,ROUNDUP(MOD(COLUMN()-1,31.001),0)),2),Auxiliar!$D$1:$E$7,2,0),'Feriados y días laborables'!$E$5:$F$11,2,0)=\"Si\"))","v":true},{"$f":"AND(NOT(ISNUMBER(MATCH(DATE($A$7,INT((COLUMN()-1)/31.001)+1,ROUNDUP(MOD(COLUMN()-1,31.001),0)),Feriados,0))),(VLOOKUP(VLOOKUP(WEEKDAY(DATE($A$7,INT((COLUMN()-1)/31.001)+1,ROUNDUP(MOD(COLUMN()-1,31.001),0)),2),Auxiliar!$D$1:$E$7,2,0),'Feriados y días laborables'!$E$5:$F$11,2,0)=\"Si\"))","v":false},{"$f":"AND(NOT(ISNUMBER(MATCH(DATE($A$7,INT((COLUMN()-1)/31.001)+1,ROUNDUP(MOD(COLUMN()-1,31.001),0)),Feriados,0))),(VLOOKUP(VLOOKUP(WEEKDAY(DATE($A$7,INT((COLUMN()-1)/31.001)+1,ROUNDUP(MOD(COLUMN()-1,31.001),0)),2),Auxiliar!$D$1:$E$7,2,0),'Feriados y días laborables'!$E$5:$F$11,2,0)=\"Si\"))","v":false},{"$f":"AND(NOT(ISNUMBER(MATCH(DATE($A$7,INT((COLUMN()-1)/31.001)+1,ROUNDUP(MOD(COLUMN()-1,31.001),0)),Feriados,0))),(VLOOKUP(VLOOKUP(WEEKDAY(DATE($A$7,INT((COLUMN()-1)/31.001)+1,ROUNDUP(MOD(COLUMN()-1,31.001),0)),2),Auxiliar!$D$1:$E$7,2,0),'Feriados y días laborables'!$E$5:$F$11,2,0)=\"Si\"))","v":true},{"$f":"AND(NOT(ISNUMBER(MATCH(DATE($A$7,INT((COLUMN()-1)/31.001)+1,ROUNDUP(MOD(COLUMN()-1,31.001),0)),Feriados,0))),(VLOOKUP(VLOOKUP(WEEKDAY(DATE($A$7,INT((COLUMN()-1)/31.001)+1,ROUNDUP(MOD(COLUMN()-1,31.001),0)),2),Auxiliar!$D$1:$E$7,2,0),'Feriados y días laborables'!$E$5:$F$11,2,0)=\"Si\"))","v":true},{"$f":"AND(NOT(ISNUMBER(MATCH(DATE($A$7,INT((COLUMN()-1)/31.001)+1,ROUNDUP(MOD(COLUMN()-1,31.001),0)),Feriados,0))),(VLOOKUP(VLOOKUP(WEEKDAY(DATE($A$7,INT((COLUMN()-1)/31.001)+1,ROUNDUP(MOD(COLUMN()-1,31.001),0)),2),Auxiliar!$D$1:$E$7,2,0),'Feriados y días laborables'!$E$5:$F$11,2,0)=\"Si\"))","v":true},{"$f":"AND(NOT(ISNUMBER(MATCH(DATE($A$7,INT((COLUMN()-1)/31.001)+1,ROUNDUP(MOD(COLUMN()-1,31.001),0)),Feriados,0))),(VLOOKUP(VLOOKUP(WEEKDAY(DATE($A$7,INT((COLUMN()-1)/31.001)+1,ROUNDUP(MOD(COLUMN()-1,31.001),0)),2),Auxiliar!$D$1:$E$7,2,0),'Feriados y días laborables'!$E$5:$F$11,2,0)=\"Si\"))","v":true},{"$f":"AND(NOT(ISNUMBER(MATCH(DATE($A$7,INT((COLUMN()-1)/31.001)+1,ROUNDUP(MOD(COLUMN()-1,31.001),0)),Feriados,0))),(VLOOKUP(VLOOKUP(WEEKDAY(DATE($A$7,INT((COLUMN()-1)/31.001)+1,ROUNDUP(MOD(COLUMN()-1,31.001),0)),2),Auxiliar!$D$1:$E$7,2,0),'Feriados y días laborables'!$E$5:$F$11,2,0)=\"Si\"))","v":true},{"$f":"AND(NOT(ISNUMBER(MATCH(DATE($A$7,INT((COLUMN()-1)/31.001)+1,ROUNDUP(MOD(COLUMN()-1,31.001),0)),Feriados,0))),(VLOOKUP(VLOOKUP(WEEKDAY(DATE($A$7,INT((COLUMN()-1)/31.001)+1,ROUNDUP(MOD(COLUMN()-1,31.001),0)),2),Auxiliar!$D$1:$E$7,2,0),'Feriados y días laborables'!$E$5:$F$11,2,0)=\"Si\"))","v":false},{"$f":"AND(NOT(ISNUMBER(MATCH(DATE($A$7,INT((COLUMN()-1)/31.001)+1,ROUNDUP(MOD(COLUMN()-1,31.001),0)),Feriados,0))),(VLOOKUP(VLOOKUP(WEEKDAY(DATE($A$7,INT((COLUMN()-1)/31.001)+1,ROUNDUP(MOD(COLUMN()-1,31.001),0)),2),Auxiliar!$D$1:$E$7,2,0),'Feriados y días laborables'!$E$5:$F$11,2,0)=\"Si\"))","v":false},{"$f":"AND(NOT(ISNUMBER(MATCH(DATE($A$7,INT((COLUMN()-1)/31.001)+1,ROUNDUP(MOD(COLUMN()-1,31.001),0)),Feriados,0))),(VLOOKUP(VLOOKUP(WEEKDAY(DATE($A$7,INT((COLUMN()-1)/31.001)+1,ROUNDUP(MOD(COLUMN()-1,31.001),0)),2),Auxiliar!$D$1:$E$7,2,0),'Feriados y días laborables'!$E$5:$F$11,2,0)=\"Si\"))","v":true},{"$f":"AND(NOT(ISNUMBER(MATCH(DATE($A$7,INT((COLUMN()-1)/31.001)+1,ROUNDUP(MOD(COLUMN()-1,31.001),0)),Feriados,0))),(VLOOKUP(VLOOKUP(WEEKDAY(DATE($A$7,INT((COLUMN()-1)/31.001)+1,ROUNDUP(MOD(COLUMN()-1,31.001),0)),2),Auxiliar!$D$1:$E$7,2,0),'Feriados y días laborables'!$E$5:$F$11,2,0)=\"Si\"))","v":true},{"$f":"AND(NOT(ISNUMBER(MATCH(DATE($A$7,INT((COLUMN()-1)/31.001)+1,ROUNDUP(MOD(COLUMN()-1,31.001),0)),Feriados,0))),(VLOOKUP(VLOOKUP(WEEKDAY(DATE($A$7,INT((COLUMN()-1)/31.001)+1,ROUNDUP(MOD(COLUMN()-1,31.001),0)),2),Auxiliar!$D$1:$E$7,2,0),'Feriados y días laborables'!$E$5:$F$11,2,0)=\"Si\"))","v":true},{"$f":"AND(NOT(ISNUMBER(MATCH(DATE($A$7,INT((COLUMN()-1)/31.001)+1,ROUNDUP(MOD(COLUMN()-1,31.001),0)),Feriados,0))),(VLOOKUP(VLOOKUP(WEEKDAY(DATE($A$7,INT((COLUMN()-1)/31.001)+1,ROUNDUP(MOD(COLUMN()-1,31.001),0)),2),Auxiliar!$D$1:$E$7,2,0),'Feriados y días laborables'!$E$5:$F$11,2,0)=\"Si\"))","v":true},{"$f":"AND(NOT(ISNUMBER(MATCH(DATE($A$7,INT((COLUMN()-1)/31.001)+1,ROUNDUP(MOD(COLUMN()-1,31.001),0)),Feriados,0))),(VLOOKUP(VLOOKUP(WEEKDAY(DATE($A$7,INT((COLUMN()-1)/31.001)+1,ROUNDUP(MOD(COLUMN()-1,31.001),0)),2),Auxiliar!$D$1:$E$7,2,0),'Feriados y días laborables'!$E$5:$F$11,2,0)=\"Si\"))","v":true},{"$f":"AND(NOT(ISNUMBER(MATCH(DATE($A$7,INT((COLUMN()-1)/31.001)+1,ROUNDUP(MOD(COLUMN()-1,31.001),0)),Feriados,0))),(VLOOKUP(VLOOKUP(WEEKDAY(DATE($A$7,INT((COLUMN()-1)/31.001)+1,ROUNDUP(MOD(COLUMN()-1,31.001),0)),2),Auxiliar!$D$1:$E$7,2,0),'Feriados y días laborables'!$E$5:$F$11,2,0)=\"Si\"))","v":false},{"$f":"AND(NOT(ISNUMBER(MATCH(DATE($A$7,INT((COLUMN()-1)/31.001)+1,ROUNDUP(MOD(COLUMN()-1,31.001),0)),Feriados,0))),(VLOOKUP(VLOOKUP(WEEKDAY(DATE($A$7,INT((COLUMN()-1)/31.001)+1,ROUNDUP(MOD(COLUMN()-1,31.001),0)),2),Auxiliar!$D$1:$E$7,2,0),'Feriados y días laborables'!$E$5:$F$11,2,0)=\"Si\"))","v":false},{"$f":"AND(NOT(ISNUMBER(MATCH(DATE($A$7,INT((COLUMN()-1)/31.001)+1,ROUNDUP(MOD(COLUMN()-1,31.001),0)),Feriados,0))),(VLOOKUP(VLOOKUP(WEEKDAY(DATE($A$7,INT((COLUMN()-1)/31.001)+1,ROUNDUP(MOD(COLUMN()-1,31.001),0)),2),Auxiliar!$D$1:$E$7,2,0),'Feriados y días laborables'!$E$5:$F$11,2,0)=\"Si\"))","v":true},{"$f":"AND(NOT(ISNUMBER(MATCH(DATE($A$7,INT((COLUMN()-1)/31.001)+1,ROUNDUP(MOD(COLUMN()-1,31.001),0)),Feriados,0))),(VLOOKUP(VLOOKUP(WEEKDAY(DATE($A$7,INT((COLUMN()-1)/31.001)+1,ROUNDUP(MOD(COLUMN()-1,31.001),0)),2),Auxiliar!$D$1:$E$7,2,0),'Feriados y días laborables'!$E$5:$F$11,2,0)=\"Si\"))","v":true},{"$f":"AND(NOT(ISNUMBER(MATCH(DATE($A$7,INT((COLUMN()-1)/31.001)+1,ROUNDUP(MOD(COLUMN()-1,31.001),0)),Feriados,0))),(VLOOKUP(VLOOKUP(WEEKDAY(DATE($A$7,INT((COLUMN()-1)/31.001)+1,ROUNDUP(MOD(COLUMN()-1,31.001),0)),2),Auxiliar!$D$1:$E$7,2,0),'Feriados y días laborables'!$E$5:$F$11,2,0)=\"Si\"))","v":true},{"$f":"AND(NOT(ISNUMBER(MATCH(DATE($A$7,INT((COLUMN()-1)/31.001)+1,ROUNDUP(MOD(COLUMN()-1,31.001),0)),Feriados,0))),(VLOOKUP(VLOOKUP(WEEKDAY(DATE($A$7,INT((COLUMN()-1)/31.001)+1,ROUNDUP(MOD(COLUMN()-1,31.001),0)),2),Auxiliar!$D$1:$E$7,2,0),'Feriados y días laborables'!$E$5:$F$11,2,0)=\"Si\"))","v":true},{"$f":"AND(NOT(ISNUMBER(MATCH(DATE($A$7,INT((COLUMN()-1)/31.001)+1,ROUNDUP(MOD(COLUMN()-1,31.001),0)),Feriados,0))),(VLOOKUP(VLOOKUP(WEEKDAY(DATE($A$7,INT((COLUMN()-1)/31.001)+1,ROUNDUP(MOD(COLUMN()-1,31.001),0)),2),Auxiliar!$D$1:$E$7,2,0),'Feriados y días laborables'!$E$5:$F$11,2,0)=\"Si\"))","v":true},{"$f":"AND(NOT(ISNUMBER(MATCH(DATE($A$7,INT((COLUMN()-1)/31.001)+1,ROUNDUP(MOD(COLUMN()-1,31.001),0)),Feriados,0))),(VLOOKUP(VLOOKUP(WEEKDAY(DATE($A$7,INT((COLUMN()-1)/31.001)+1,ROUNDUP(MOD(COLUMN()-1,31.001),0)),2),Auxiliar!$D$1:$E$7,2,0),'Feriados y días laborables'!$E$5:$F$11,2,0)=\"Si\"))","v":false},{"$f":"AND(NOT(ISNUMBER(MATCH(DATE($A$7,INT((COLUMN()-1)/31.001)+1,ROUNDUP(MOD(COLUMN()-1,31.001),0)),Feriados,0))),(VLOOKUP(VLOOKUP(WEEKDAY(DATE($A$7,INT((COLUMN()-1)/31.001)+1,ROUNDUP(MOD(COLUMN()-1,31.001),0)),2),Auxiliar!$D$1:$E$7,2,0),'Feriados y días laborables'!$E$5:$F$11,2,0)=\"Si\"))","v":false},{"$f":"AND(NOT(ISNUMBER(MATCH(DATE($A$7,INT((COLUMN()-1)/31.001)+1,ROUNDUP(MOD(COLUMN()-1,31.001),0)),Feriados,0))),(VLOOKUP(VLOOKUP(WEEKDAY(DATE($A$7,INT((COLUMN()-1)/31.001)+1,ROUNDUP(MOD(COLUMN()-1,31.001),0)),2),Auxiliar!$D$1:$E$7,2,0),'Feriados y días laborables'!$E$5:$F$11,2,0)=\"Si\"))","v":true},{"$f":"AND(NOT(ISNUMBER(MATCH(DATE($A$7,INT((COLUMN()-1)/31.001)+1,ROUNDUP(MOD(COLUMN()-1,31.001),0)),Feriados,0))),(VLOOKUP(VLOOKUP(WEEKDAY(DATE($A$7,INT((COLUMN()-1)/31.001)+1,ROUNDUP(MOD(COLUMN()-1,31.001),0)),2),Auxiliar!$D$1:$E$7,2,0),'Feriados y días laborables'!$E$5:$F$11,2,0)=\"Si\"))","v":true},{"$f":"AND(NOT(ISNUMBER(MATCH(DATE($A$7,INT((COLUMN()-1)/31.001)+1,ROUNDUP(MOD(COLUMN()-1,31.001),0)),Feriados,0))),(VLOOKUP(VLOOKUP(WEEKDAY(DATE($A$7,INT((COLUMN()-1)/31.001)+1,ROUNDUP(MOD(COLUMN()-1,31.001),0)),2),Auxiliar!$D$1:$E$7,2,0),'Feriados y días laborables'!$E$5:$F$11,2,0)=\"Si\"))","v":true},{"$f":"AND(NOT(ISNUMBER(MATCH(DATE($A$7,INT((COLUMN()-1)/31.001)+1,ROUNDUP(MOD(COLUMN()-1,31.001),0)),Feriados,0))),(VLOOKUP(VLOOKUP(WEEKDAY(DATE($A$7,INT((COLUMN()-1)/31.001)+1,ROUNDUP(MOD(COLUMN()-1,31.001),0)),2),Auxiliar!$D$1:$E$7,2,0),'Feriados y días laborables'!$E$5:$F$11,2,0)=\"Si\"))","v":true},{"$f":"AND(NOT(ISNUMBER(MATCH(DATE($A$7,INT((COLUMN()-1)/31.001)+1,ROUNDUP(MOD(COLUMN()-1,31.001),0)),Feriados,0))),(VLOOKUP(VLOOKUP(WEEKDAY(DATE($A$7,INT((COLUMN()-1)/31.001)+1,ROUNDUP(MOD(COLUMN()-1,31.001),0)),2),Auxiliar!$D$1:$E$7,2,0),'Feriados y días laborables'!$E$5:$F$11,2,0)=\"Si\"))","v":true},{"$f":"AND(NOT(ISNUMBER(MATCH(DATE($A$7,INT((COLUMN()-1)/31.001)+1,ROUNDUP(MOD(COLUMN()-1,31.001),0)),Feriados,0))),(VLOOKUP(VLOOKUP(WEEKDAY(DATE($A$7,INT((COLUMN()-1)/31.001)+1,ROUNDUP(MOD(COLUMN()-1,31.001),0)),2),Auxiliar!$D$1:$E$7,2,0),'Feriados y días laborables'!$E$5:$F$11,2,0)=\"Si\"))","v":false},{"$f":"AND(NOT(ISNUMBER(MATCH(DATE($A$7,INT((COLUMN()-1)/31.001)+1,ROUNDUP(MOD(COLUMN()-1,31.001),0)),Feriados,0))),(VLOOKUP(VLOOKUP(WEEKDAY(DATE($A$7,INT((COLUMN()-1)/31.001)+1,ROUNDUP(MOD(COLUMN()-1,31.001),0)),2),Auxiliar!$D$1:$E$7,2,0),'Feriados y días laborables'!$E$5:$F$11,2,0)=\"Si\"))","v":false},{"$f":"AND(NOT(ISNUMBER(MATCH(DATE($A$7,INT((COLUMN()-1)/31.001)+1,ROUNDUP(MOD(COLUMN()-1,31.001),0)),Feriados,0))),(VLOOKUP(VLOOKUP(WEEKDAY(DATE($A$7,INT((COLUMN()-1)/31.001)+1,ROUNDUP(MOD(COLUMN()-1,31.001),0)),2),Auxiliar!$D$1:$E$7,2,0),'Feriados y días laborables'!$E$5:$F$11,2,0)=\"Si\"))","v":true},{"$f":"AND(NOT(ISNUMBER(MATCH(DATE($A$7,INT((COLUMN()-1)/31.001)+1,ROUNDUP(MOD(COLUMN()-1,31.001),0)),Feriados,0))),(VLOOKUP(VLOOKUP(WEEKDAY(DATE($A$7,INT((COLUMN()-1)/31.001)+1,ROUNDUP(MOD(COLUMN()-1,31.001),0)),2),Auxiliar!$D$1:$E$7,2,0),'Feriados y días laborables'!$E$5:$F$11,2,0)=\"Si\"))","v":true},{"$f":"AND(NOT(ISNUMBER(MATCH(DATE($A$7,INT((COLUMN()-1)/31.001)+1,ROUNDUP(MOD(COLUMN()-1,31.001),0)),Feriados,0))),(VLOOKUP(VLOOKUP(WEEKDAY(DATE($A$7,INT((COLUMN()-1)/31.001)+1,ROUNDUP(MOD(COLUMN()-1,31.001),0)),2),Auxiliar!$D$1:$E$7,2,0),'Feriados y días laborables'!$E$5:$F$11,2,0)=\"Si\"))","v":true},{"$f":"AND(NOT(ISNUMBER(MATCH(DATE($A$7,INT((COLUMN()-1)/31.001)+1,ROUNDUP(MOD(COLUMN()-1,31.001),0)),Feriados,0))),(VLOOKUP(VLOOKUP(WEEKDAY(DATE($A$7,INT((COLUMN()-1)/31.001)+1,ROUNDUP(MOD(COLUMN()-1,31.001),0)),2),Auxiliar!$D$1:$E$7,2,0),'Feriados y días laborables'!$E$5:$F$11,2,0)=\"Si\"))","v":true},{"$f":"AND(NOT(ISNUMBER(MATCH(DATE($A$7,INT((COLUMN()-1)/31.001)+1,ROUNDUP(MOD(COLUMN()-1,31.001),0)),Feriados,0))),(VLOOKUP(VLOOKUP(WEEKDAY(DATE($A$7,INT((COLUMN()-1)/31.001)+1,ROUNDUP(MOD(COLUMN()-1,31.001),0)),2),Auxiliar!$D$1:$E$7,2,0),'Feriados y días laborables'!$E$5:$F$11,2,0)=\"Si\"))","v":true},{"$f":"AND(NOT(ISNUMBER(MATCH(DATE($A$7,INT((COLUMN()-1)/31.001)+1,ROUNDUP(MOD(COLUMN()-1,31.001),0)),Feriados,0))),(VLOOKUP(VLOOKUP(WEEKDAY(DATE($A$7,INT((COLUMN()-1)/31.001)+1,ROUNDUP(MOD(COLUMN()-1,31.001),0)),2),Auxiliar!$D$1:$E$7,2,0),'Feriados y días laborables'!$E$5:$F$11,2,0)=\"Si\"))","v":false},{"$f":"AND(NOT(ISNUMBER(MATCH(DATE($A$7,INT((COLUMN()-1)/31.001)+1,ROUNDUP(MOD(COLUMN()-1,31.001),0)),Feriados,0))),(VLOOKUP(VLOOKUP(WEEKDAY(DATE($A$7,INT((COLUMN()-1)/31.001)+1,ROUNDUP(MOD(COLUMN()-1,31.001),0)),2),Auxiliar!$D$1:$E$7,2,0),'Feriados y días laborables'!$E$5:$F$11,2,0)=\"Si\"))","v":false},{"$f":"AND(NOT(ISNUMBER(MATCH(DATE($A$7,INT((COLUMN()-1)/31.001)+1,ROUNDUP(MOD(COLUMN()-1,31.001),0)),Feriados,0))),(VLOOKUP(VLOOKUP(WEEKDAY(DATE($A$7,INT((COLUMN()-1)/31.001)+1,ROUNDUP(MOD(COLUMN()-1,31.001),0)),2),Auxiliar!$D$1:$E$7,2,0),'Feriados y días laborables'!$E$5:$F$11,2,0)=\"Si\"))","v":true},{"$f":"AND(NOT(ISNUMBER(MATCH(DATE($A$7,INT((COLUMN()-1)/31.001)+1,ROUNDUP(MOD(COLUMN()-1,31.001),0)),Feriados,0))),(VLOOKUP(VLOOKUP(WEEKDAY(DATE($A$7,INT((COLUMN()-1)/31.001)+1,ROUNDUP(MOD(COLUMN()-1,31.001),0)),2),Auxiliar!$D$1:$E$7,2,0),'Feriados y días laborables'!$E$5:$F$11,2,0)=\"Si\"))","v":true},{"$f":"AND(NOT(ISNUMBER(MATCH(DATE($A$7,INT((COLUMN()-1)/31.001)+1,ROUNDUP(MOD(COLUMN()-1,31.001),0)),Feriados,0))),(VLOOKUP(VLOOKUP(WEEKDAY(DATE($A$7,INT((COLUMN()-1)/31.001)+1,ROUNDUP(MOD(COLUMN()-1,31.001),0)),2),Auxiliar!$D$1:$E$7,2,0),'Feriados y días laborables'!$E$5:$F$11,2,0)=\"Si\"))","v":true},{"$f":"AND(NOT(ISNUMBER(MATCH(DATE($A$7,INT((COLUMN()-1)/31.001)+1,ROUNDUP(MOD(COLUMN()-1,31.001),0)),Feriados,0))),(VLOOKUP(VLOOKUP(WEEKDAY(DATE($A$7,INT((COLUMN()-1)/31.001)+1,ROUNDUP(MOD(COLUMN()-1,31.001),0)),2),Auxiliar!$D$1:$E$7,2,0),'Feriados y días laborables'!$E$5:$F$11,2,0)=\"Si\"))","v":true},{"$f":"AND(NOT(ISNUMBER(MATCH(DATE($A$7,INT((COLUMN()-1)/31.001)+1,ROUNDUP(MOD(COLUMN()-1,31.001),0)),Feriados,0))),(VLOOKUP(VLOOKUP(WEEKDAY(DATE($A$7,INT((COLUMN()-1)/31.001)+1,ROUNDUP(MOD(COLUMN()-1,31.001),0)),2),Auxiliar!$D$1:$E$7,2,0),'Feriados y días laborables'!$E$5:$F$11,2,0)=\"Si\"))","v":true},{"$f":"AND(NOT(ISNUMBER(MATCH(DATE($A$7,INT((COLUMN()-1)/31.001)+1,ROUNDUP(MOD(COLUMN()-1,31.001),0)),Feriados,0))),(VLOOKUP(VLOOKUP(WEEKDAY(DATE($A$7,INT((COLUMN()-1)/31.001)+1,ROUNDUP(MOD(COLUMN()-1,31.001),0)),2),Auxiliar!$D$1:$E$7,2,0),'Feriados y días laborables'!$E$5:$F$11,2,0)=\"Si\"))","v":false},{"$f":"AND(NOT(ISNUMBER(MATCH(DATE($A$7,INT((COLUMN()-1)/31.001)+1,ROUNDUP(MOD(COLUMN()-1,31.001),0)),Feriados,0))),(VLOOKUP(VLOOKUP(WEEKDAY(DATE($A$7,INT((COLUMN()-1)/31.001)+1,ROUNDUP(MOD(COLUMN()-1,31.001),0)),2),Auxiliar!$D$1:$E$7,2,0),'Feriados y días laborables'!$E$5:$F$11,2,0)=\"Si\"))","v":false},{"$f":"AND(NOT(ISNUMBER(MATCH(DATE($A$7,INT((COLUMN()-1)/31.001)+1,ROUNDUP(MOD(COLUMN()-1,31.001),0)),Feriados,0))),(VLOOKUP(VLOOKUP(WEEKDAY(DATE($A$7,INT((COLUMN()-1)/31.001)+1,ROUNDUP(MOD(COLUMN()-1,31.001),0)),2),Auxiliar!$D$1:$E$7,2,0),'Feriados y días laborables'!$E$5:$F$11,2,0)=\"Si\"))","v":true},{"$f":"AND(NOT(ISNUMBER(MATCH(DATE($A$7,INT((COLUMN()-1)/31.001)+1,ROUNDUP(MOD(COLUMN()-1,31.001),0)),Feriados,0))),(VLOOKUP(VLOOKUP(WEEKDAY(DATE($A$7,INT((COLUMN()-1)/31.001)+1,ROUNDUP(MOD(COLUMN()-1,31.001),0)),2),Auxiliar!$D$1:$E$7,2,0),'Feriados y días laborables'!$E$5:$F$11,2,0)=\"Si\"))","v":true},{"$f":"AND(NOT(ISNUMBER(MATCH(DATE($A$7,INT((COLUMN()-1)/31.001)+1,ROUNDUP(MOD(COLUMN()-1,31.001),0)),Feriados,0))),(VLOOKUP(VLOOKUP(WEEKDAY(DATE($A$7,INT((COLUMN()-1)/31.001)+1,ROUNDUP(MOD(COLUMN()-1,31.001),0)),2),Auxiliar!$D$1:$E$7,2,0),'Feriados y días laborables'!$E$5:$F$11,2,0)=\"Si\"))","v":true},{"$f":"AND(NOT(ISNUMBER(MATCH(DATE($A$7,INT((COLUMN()-1)/31.001)+1,ROUNDUP(MOD(COLUMN()-1,31.001),0)),Feriados,0))),(VLOOKUP(VLOOKUP(WEEKDAY(DATE($A$7,INT((COLUMN()-1)/31.001)+1,ROUNDUP(MOD(COLUMN()-1,31.001),0)),2),Auxiliar!$D$1:$E$7,2,0),'Feriados y días laborables'!$E$5:$F$11,2,0)=\"Si\"))","v":true},{"$f":"AND(NOT(ISNUMBER(MATCH(DATE($A$7,INT((COLUMN()-1)/31.001)+1,ROUNDUP(MOD(COLUMN()-1,31.001),0)),Feriados,0))),(VLOOKUP(VLOOKUP(WEEKDAY(DATE($A$7,INT((COLUMN()-1)/31.001)+1,ROUNDUP(MOD(COLUMN()-1,31.001),0)),2),Auxiliar!$D$1:$E$7,2,0),'Feriados y días laborables'!$E$5:$F$11,2,0)=\"Si\"))","v":true},{"$f":"AND(NOT(ISNUMBER(MATCH(DATE($A$7,INT((COLUMN()-1)/31.001)+1,ROUNDUP(MOD(COLUMN()-1,31.001),0)),Feriados,0))),(VLOOKUP(VLOOKUP(WEEKDAY(DATE($A$7,INT((COLUMN()-1)/31.001)+1,ROUNDUP(MOD(COLUMN()-1,31.001),0)),2),Auxiliar!$D$1:$E$7,2,0),'Feriados y días laborables'!$E$5:$F$11,2,0)=\"Si\"))","v":false},{"$f":"AND(NOT(ISNUMBER(MATCH(DATE($A$7,INT((COLUMN()-1)/31.001)+1,ROUNDUP(MOD(COLUMN()-1,31.001),0)),Feriados,0))),(VLOOKUP(VLOOKUP(WEEKDAY(DATE($A$7,INT((COLUMN()-1)/31.001)+1,ROUNDUP(MOD(COLUMN()-1,31.001),0)),2),Auxiliar!$D$1:$E$7,2,0),'Feriados y días laborables'!$E$5:$F$11,2,0)=\"Si\"))","v":false},{"$f":"AND(NOT(ISNUMBER(MATCH(DATE($A$7,INT((COLUMN()-1)/31.001)+1,ROUNDUP(MOD(COLUMN()-1,31.001),0)),Feriados,0))),(VLOOKUP(VLOOKUP(WEEKDAY(DATE($A$7,INT((COLUMN()-1)/31.001)+1,ROUNDUP(MOD(COLUMN()-1,31.001),0)),2),Auxiliar!$D$1:$E$7,2,0),'Feriados y días laborables'!$E$5:$F$11,2,0)=\"Si\"))","v":true},{"$f":"AND(NOT(ISNUMBER(MATCH(DATE($A$7,INT((COLUMN()-1)/31.001)+1,ROUNDUP(MOD(COLUMN()-1,31.001),0)),Feriados,0))),(VLOOKUP(VLOOKUP(WEEKDAY(DATE($A$7,INT((COLUMN()-1)/31.001)+1,ROUNDUP(MOD(COLUMN()-1,31.001),0)),2),Auxiliar!$D$1:$E$7,2,0),'Feriados y días laborables'!$E$5:$F$11,2,0)=\"Si\"))","v":true},{"$f":"AND(NOT(ISNUMBER(MATCH(DATE($A$7,INT((COLUMN()-1)/31.001)+1,ROUNDUP(MOD(COLUMN()-1,31.001),0)),Feriados,0))),(VLOOKUP(VLOOKUP(WEEKDAY(DATE($A$7,INT((COLUMN()-1)/31.001)+1,ROUNDUP(MOD(COLUMN()-1,31.001),0)),2),Auxiliar!$D$1:$E$7,2,0),'Feriados y días laborables'!$E$5:$F$11,2,0)=\"Si\"))","v":true},{"$f":"AND(NOT(ISNUMBER(MATCH(DATE($A$7,INT((COLUMN()-1)/31.001)+1,ROUNDUP(MOD(COLUMN()-1,31.001),0)),Feriados,0))),(VLOOKUP(VLOOKUP(WEEKDAY(DATE($A$7,INT((COLUMN()-1)/31.001)+1,ROUNDUP(MOD(COLUMN()-1,31.001),0)),2),Auxiliar!$D$1:$E$7,2,0),'Feriados y días laborables'!$E$5:$F$11,2,0)=\"Si\"))","v":true},{"$f":"AND(NOT(ISNUMBER(MATCH(DATE($A$7,INT((COLUMN()-1)/31.001)+1,ROUNDUP(MOD(COLUMN()-1,31.001),0)),Feriados,0))),(VLOOKUP(VLOOKUP(WEEKDAY(DATE($A$7,INT((COLUMN()-1)/31.001)+1,ROUNDUP(MOD(COLUMN()-1,31.001),0)),2),Auxiliar!$D$1:$E$7,2,0),'Feriados y días laborables'!$E$5:$F$11,2,0)=\"Si\"))","v":true},{"$f":"AND(NOT(ISNUMBER(MATCH(DATE($A$7,INT((COLUMN()-1)/31.001)+1,ROUNDUP(MOD(COLUMN()-1,31.001),0)),Feriados,0))),(VLOOKUP(VLOOKUP(WEEKDAY(DATE($A$7,INT((COLUMN()-1)/31.001)+1,ROUNDUP(MOD(COLUMN()-1,31.001),0)),2),Auxiliar!$D$1:$E$7,2,0),'Feriados y días laborables'!$E$5:$F$11,2,0)=\"Si\"))","v":false},{"$f":"AND(NOT(ISNUMBER(MATCH(DATE($A$7,INT((COLUMN()-1)/31.001)+1,ROUNDUP(MOD(COLUMN()-1,31.001),0)),Feriados,0))),(VLOOKUP(VLOOKUP(WEEKDAY(DATE($A$7,INT((COLUMN()-1)/31.001)+1,ROUNDUP(MOD(COLUMN()-1,31.001),0)),2),Auxiliar!$D$1:$E$7,2,0),'Feriados y días laborables'!$E$5:$F$11,2,0)=\"Si\"))","v":false},{"$f":"AND(NOT(ISNUMBER(MATCH(DATE($A$7,INT((COLUMN()-1)/31.001)+1,ROUNDUP(MOD(COLUMN()-1,31.001),0)),Feriados,0))),(VLOOKUP(VLOOKUP(WEEKDAY(DATE($A$7,INT((COLUMN()-1)/31.001)+1,ROUNDUP(MOD(COLUMN()-1,31.001),0)),2),Auxiliar!$D$1:$E$7,2,0),'Feriados y días laborables'!$E$5:$F$11,2,0)=\"Si\"))","v":true},{"$f":"AND(NOT(ISNUMBER(MATCH(DATE($A$7,INT((COLUMN()-1)/31.001)+1,ROUNDUP(MOD(COLUMN()-1,31.001),0)),Feriados,0))),(VLOOKUP(VLOOKUP(WEEKDAY(DATE($A$7,INT((COLUMN()-1)/31.001)+1,ROUNDUP(MOD(COLUMN()-1,31.001),0)),2),Auxiliar!$D$1:$E$7,2,0),'Feriados y días laborables'!$E$5:$F$11,2,0)=\"Si\"))","v":true},{"$f":"AND(NOT(ISNUMBER(MATCH(DATE($A$7,INT((COLUMN()-1)/31.001)+1,ROUNDUP(MOD(COLUMN()-1,31.001),0)),Feriados,0))),(VLOOKUP(VLOOKUP(WEEKDAY(DATE($A$7,INT((COLUMN()-1)/31.001)+1,ROUNDUP(MOD(COLUMN()-1,31.001),0)),2),Auxiliar!$D$1:$E$7,2,0),'Feriados y días laborables'!$E$5:$F$11,2,0)=\"Si\"))","v":true},{"$f":"AND(NOT(ISNUMBER(MATCH(DATE($A$7,INT((COLUMN()-1)/31.001)+1,ROUNDUP(MOD(COLUMN()-1,31.001),0)),Feriados,0))),(VLOOKUP(VLOOKUP(WEEKDAY(DATE($A$7,INT((COLUMN()-1)/31.001)+1,ROUNDUP(MOD(COLUMN()-1,31.001),0)),2),Auxiliar!$D$1:$E$7,2,0),'Feriados y días laborables'!$E$5:$F$11,2,0)=\"Si\"))","v":true},{"$f":"AND(NOT(ISNUMBER(MATCH(DATE($A$7,INT((COLUMN()-1)/31.001)+1,ROUNDUP(MOD(COLUMN()-1,31.001),0)),Feriados,0))),(VLOOKUP(VLOOKUP(WEEKDAY(DATE($A$7,INT((COLUMN()-1)/31.001)+1,ROUNDUP(MOD(COLUMN()-1,31.001),0)),2),Auxiliar!$D$1:$E$7,2,0),'Feriados y días laborables'!$E$5:$F$11,2,0)=\"Si\"))","v":true},{"$f":"AND(NOT(ISNUMBER(MATCH(DATE($A$7,INT((COLUMN()-1)/31.001)+1,ROUNDUP(MOD(COLUMN()-1,31.001),0)),Feriados,0))),(VLOOKUP(VLOOKUP(WEEKDAY(DATE($A$7,INT((COLUMN()-1)/31.001)+1,ROUNDUP(MOD(COLUMN()-1,31.001),0)),2),Auxiliar!$D$1:$E$7,2,0),'Feriados y días laborables'!$E$5:$F$11,2,0)=\"Si\"))","v":false},{"$f":"AND(NOT(ISNUMBER(MATCH(DATE($A$7,INT((COLUMN()-1)/31.001)+1,ROUNDUP(MOD(COLUMN()-1,31.001),0)),Feriados,0))),(VLOOKUP(VLOOKUP(WEEKDAY(DATE($A$7,INT((COLUMN()-1)/31.001)+1,ROUNDUP(MOD(COLUMN()-1,31.001),0)),2),Auxiliar!$D$1:$E$7,2,0),'Feriados y días laborables'!$E$5:$F$11,2,0)=\"Si\"))","v":false},{"$f":"AND(NOT(ISNUMBER(MATCH(DATE($A$7,INT((COLUMN()-1)/31.001)+1,ROUNDUP(MOD(COLUMN()-1,31.001),0)),Feriados,0))),(VLOOKUP(VLOOKUP(WEEKDAY(DATE($A$7,INT((COLUMN()-1)/31.001)+1,ROUNDUP(MOD(COLUMN()-1,31.001),0)),2),Auxiliar!$D$1:$E$7,2,0),'Feriados y días laborables'!$E$5:$F$11,2,0)=\"Si\"))","v":true},{"$f":"AND(NOT(ISNUMBER(MATCH(DATE($A$7,INT((COLUMN()-1)/31.001)+1,ROUNDUP(MOD(COLUMN()-1,31.001),0)),Feriados,0))),(VLOOKUP(VLOOKUP(WEEKDAY(DATE($A$7,INT((COLUMN()-1)/31.001)+1,ROUNDUP(MOD(COLUMN()-1,31.001),0)),2),Auxiliar!$D$1:$E$7,2,0),'Feriados y días laborables'!$E$5:$F$11,2,0)=\"Si\"))","v":true},{"$f":"AND(NOT(ISNUMBER(MATCH(DATE($A$7,INT((COLUMN()-1)/31.001)+1,ROUNDUP(MOD(COLUMN()-1,31.001),0)),Feriados,0))),(VLOOKUP(VLOOKUP(WEEKDAY(DATE($A$7,INT((COLUMN()-1)/31.001)+1,ROUNDUP(MOD(COLUMN()-1,31.001),0)),2),Auxiliar!$D$1:$E$7,2,0),'Feriados y días laborables'!$E$5:$F$11,2,0)=\"Si\"))","v":true},{"$f":"AND(NOT(ISNUMBER(MATCH(DATE($A$7,INT((COLUMN()-1)/31.001)+1,ROUNDUP(MOD(COLUMN()-1,31.001),0)),Feriados,0))),(VLOOKUP(VLOOKUP(WEEKDAY(DATE($A$7,INT((COLUMN()-1)/31.001)+1,ROUNDUP(MOD(COLUMN()-1,31.001),0)),2),Auxiliar!$D$1:$E$7,2,0),'Feriados y días laborables'!$E$5:$F$11,2,0)=\"Si\"))","v":true},{"$f":"AND(NOT(ISNUMBER(MATCH(DATE($A$7,INT((COLUMN()-1)/31.001)+1,ROUNDUP(MOD(COLUMN()-1,31.001),0)),Feriados,0))),(VLOOKUP(VLOOKUP(WEEKDAY(DATE($A$7,INT((COLUMN()-1)/31.001)+1,ROUNDUP(MOD(COLUMN()-1,31.001),0)),2),Auxiliar!$D$1:$E$7,2,0),'Feriados y días laborables'!$E$5:$F$11,2,0)=\"Si\"))","v":true},{"$f":"AND(NOT(ISNUMBER(MATCH(DATE($A$7,INT((COLUMN()-1)/31.001)+1,ROUNDUP(MOD(COLUMN()-1,31.001),0)),Feriados,0))),(VLOOKUP(VLOOKUP(WEEKDAY(DATE($A$7,INT((COLUMN()-1)/31.001)+1,ROUNDUP(MOD(COLUMN()-1,31.001),0)),2),Auxiliar!$D$1:$E$7,2,0),'Feriados y días laborables'!$E$5:$F$11,2,0)=\"Si\"))","v":false},{"$f":"AND(NOT(ISNUMBER(MATCH(DATE($A$7,INT((COLUMN()-1)/31.001)+1,ROUNDUP(MOD(COLUMN()-1,31.001),0)),Feriados,0))),(VLOOKUP(VLOOKUP(WEEKDAY(DATE($A$7,INT((COLUMN()-1)/31.001)+1,ROUNDUP(MOD(COLUMN()-1,31.001),0)),2),Auxiliar!$D$1:$E$7,2,0),'Feriados y días laborables'!$E$5:$F$11,2,0)=\"Si\"))","v":false},{"$f":"AND(NOT(ISNUMBER(MATCH(DATE($A$7,INT((COLUMN()-1)/31.001)+1,ROUNDUP(MOD(COLUMN()-1,31.001),0)),Feriados,0))),(VLOOKUP(VLOOKUP(WEEKDAY(DATE($A$7,INT((COLUMN()-1)/31.001)+1,ROUNDUP(MOD(COLUMN()-1,31.001),0)),2),Auxiliar!$D$1:$E$7,2,0),'Feriados y días laborables'!$E$5:$F$11,2,0)=\"Si\"))","v":true},{"$f":"AND(NOT(ISNUMBER(MATCH(DATE($A$7,INT((COLUMN()-1)/31.001)+1,ROUNDUP(MOD(COLUMN()-1,31.001),0)),Feriados,0))),(VLOOKUP(VLOOKUP(WEEKDAY(DATE($A$7,INT((COLUMN()-1)/31.001)+1,ROUNDUP(MOD(COLUMN()-1,31.001),0)),2),Auxiliar!$D$1:$E$7,2,0),'Feriados y días laborables'!$E$5:$F$11,2,0)=\"Si\"))","v":true},{"$f":"AND(NOT(ISNUMBER(MATCH(DATE($A$7,INT((COLUMN()-1)/31.001)+1,ROUNDUP(MOD(COLUMN()-1,31.001),0)),Feriados,0))),(VLOOKUP(VLOOKUP(WEEKDAY(DATE($A$7,INT((COLUMN()-1)/31.001)+1,ROUNDUP(MOD(COLUMN()-1,31.001),0)),2),Auxiliar!$D$1:$E$7,2,0),'Feriados y días laborables'!$E$5:$F$11,2,0)=\"Si\"))","v":true},{"$f":"AND(NOT(ISNUMBER(MATCH(DATE($A$7,INT((COLUMN()-1)/31.001)+1,ROUNDUP(MOD(COLUMN()-1,31.001),0)),Feriados,0))),(VLOOKUP(VLOOKUP(WEEKDAY(DATE($A$7,INT((COLUMN()-1)/31.001)+1,ROUNDUP(MOD(COLUMN()-1,31.001),0)),2),Auxiliar!$D$1:$E$7,2,0),'Feriados y días laborables'!$E$5:$F$11,2,0)=\"Si\"))","v":true},{"$f":"AND(NOT(ISNUMBER(MATCH(DATE($A$7,INT((COLUMN()-1)/31.001)+1,ROUNDUP(MOD(COLUMN()-1,31.001),0)),Feriados,0))),(VLOOKUP(VLOOKUP(WEEKDAY(DATE($A$7,INT((COLUMN()-1)/31.001)+1,ROUNDUP(MOD(COLUMN()-1,31.001),0)),2),Auxiliar!$D$1:$E$7,2,0),'Feriados y días laborables'!$E$5:$F$11,2,0)=\"Si\"))","v":true},{"$f":"AND(NOT(ISNUMBER(MATCH(DATE($A$7,INT((COLUMN()-1)/31.001)+1,ROUNDUP(MOD(COLUMN()-1,31.001),0)),Feriados,0))),(VLOOKUP(VLOOKUP(WEEKDAY(DATE($A$7,INT((COLUMN()-1)/31.001)+1,ROUNDUP(MOD(COLUMN()-1,31.001),0)),2),Auxiliar!$D$1:$E$7,2,0),'Feriados y días laborables'!$E$5:$F$11,2,0)=\"Si\"))","v":false},{"$f":"AND(NOT(ISNUMBER(MATCH(DATE($A$7,INT((COLUMN()-1)/31.001)+1,ROUNDUP(MOD(COLUMN()-1,31.001),0)),Feriados,0))),(VLOOKUP(VLOOKUP(WEEKDAY(DATE($A$7,INT((COLUMN()-1)/31.001)+1,ROUNDUP(MOD(COLUMN()-1,31.001),0)),2),Auxiliar!$D$1:$E$7,2,0),'Feriados y días laborables'!$E$5:$F$11,2,0)=\"Si\"))","v":false},{"$f":"AND(NOT(ISNUMBER(MATCH(DATE($A$7,INT((COLUMN()-1)/31.001)+1,ROUNDUP(MOD(COLUMN()-1,31.001),0)),Feriados,0))),(VLOOKUP(VLOOKUP(WEEKDAY(DATE($A$7,INT((COLUMN()-1)/31.001)+1,ROUNDUP(MOD(COLUMN()-1,31.001),0)),2),Auxiliar!$D$1:$E$7,2,0),'Feriados y días laborables'!$E$5:$F$11,2,0)=\"Si\"))","v":true},{"$f":"AND(NOT(ISNUMBER(MATCH(DATE($A$7,INT((COLUMN()-1)/31.001)+1,ROUNDUP(MOD(COLUMN()-1,31.001),0)),Feriados,0))),(VLOOKUP(VLOOKUP(WEEKDAY(DATE($A$7,INT((COLUMN()-1)/31.001)+1,ROUNDUP(MOD(COLUMN()-1,31.001),0)),2),Auxiliar!$D$1:$E$7,2,0),'Feriados y días laborables'!$E$5:$F$11,2,0)=\"Si\"))","v":true},{"$f":"AND(NOT(ISNUMBER(MATCH(DATE($A$7,INT((COLUMN()-1)/31.001)+1,ROUNDUP(MOD(COLUMN()-1,31.001),0)),Feriados,0))),(VLOOKUP(VLOOKUP(WEEKDAY(DATE($A$7,INT((COLUMN()-1)/31.001)+1,ROUNDUP(MOD(COLUMN()-1,31.001),0)),2),Auxiliar!$D$1:$E$7,2,0),'Feriados y días laborables'!$E$5:$F$11,2,0)=\"Si\"))","v":true},{"$f":"AND(NOT(ISNUMBER(MATCH(DATE($A$7,INT((COLUMN()-1)/31.001)+1,ROUNDUP(MOD(COLUMN()-1,31.001),0)),Feriados,0))),(VLOOKUP(VLOOKUP(WEEKDAY(DATE($A$7,INT((COLUMN()-1)/31.001)+1,ROUNDUP(MOD(COLUMN()-1,31.001),0)),2),Auxiliar!$D$1:$E$7,2,0),'Feriados y días laborables'!$E$5:$F$11,2,0)=\"Si\"))","v":true},{"$f":"AND(NOT(ISNUMBER(MATCH(DATE($A$7,INT((COLUMN()-1)/31.001)+1,ROUNDUP(MOD(COLUMN()-1,31.001),0)),Feriados,0))),(VLOOKUP(VLOOKUP(WEEKDAY(DATE($A$7,INT((COLUMN()-1)/31.001)+1,ROUNDUP(MOD(COLUMN()-1,31.001),0)),2),Auxiliar!$D$1:$E$7,2,0),'Feriados y días laborables'!$E$5:$F$11,2,0)=\"Si\"))","v":true},{"$f":"AND(NOT(ISNUMBER(MATCH(DATE($A$7,INT((COLUMN()-1)/31.001)+1,ROUNDUP(MOD(COLUMN()-1,31.001),0)),Feriados,0))),(VLOOKUP(VLOOKUP(WEEKDAY(DATE($A$7,INT((COLUMN()-1)/31.001)+1,ROUNDUP(MOD(COLUMN()-1,31.001),0)),2),Auxiliar!$D$1:$E$7,2,0),'Feriados y días laborables'!$E$5:$F$11,2,0)=\"Si\"))","v":false},{"$f":"AND(NOT(ISNUMBER(MATCH(DATE($A$7,INT((COLUMN()-1)/31.001)+1,ROUNDUP(MOD(COLUMN()-1,31.001),0)),Feriados,0))),(VLOOKUP(VLOOKUP(WEEKDAY(DATE($A$7,INT((COLUMN()-1)/31.001)+1,ROUNDUP(MOD(COLUMN()-1,31.001),0)),2),Auxiliar!$D$1:$E$7,2,0),'Feriados y días laborables'!$E$5:$F$11,2,0)=\"Si\"))","v":false},{"$f":"AND(NOT(ISNUMBER(MATCH(DATE($A$7,INT((COLUMN()-1)/31.001)+1,ROUNDUP(MOD(COLUMN()-1,31.001),0)),Feriados,0))),(VLOOKUP(VLOOKUP(WEEKDAY(DATE($A$7,INT((COLUMN()-1)/31.001)+1,ROUNDUP(MOD(COLUMN()-1,31.001),0)),2),Auxiliar!$D$1:$E$7,2,0),'Feriados y días laborables'!$E$5:$F$11,2,0)=\"Si\"))","v":true},{"$f":"AND(NOT(ISNUMBER(MATCH(DATE($A$7,INT((COLUMN()-1)/31.001)+1,ROUNDUP(MOD(COLUMN()-1,31.001),0)),Feriados,0))),(VLOOKUP(VLOOKUP(WEEKDAY(DATE($A$7,INT((COLUMN()-1)/31.001)+1,ROUNDUP(MOD(COLUMN()-1,31.001),0)),2),Auxiliar!$D$1:$E$7,2,0),'Feriados y días laborables'!$E$5:$F$11,2,0)=\"Si\"))","v":true},{"$f":"AND(NOT(ISNUMBER(MATCH(DATE($A$7,INT((COLUMN()-1)/31.001)+1,ROUNDUP(MOD(COLUMN()-1,31.001),0)),Feriados,0))),(VLOOKUP(VLOOKUP(WEEKDAY(DATE($A$7,INT((COLUMN()-1)/31.001)+1,ROUNDUP(MOD(COLUMN()-1,31.001),0)),2),Auxiliar!$D$1:$E$7,2,0),'Feriados y días laborables'!$E$5:$F$11,2,0)=\"Si\"))","v":true},{"$f":"AND(NOT(ISNUMBER(MATCH(DATE($A$7,INT((COLUMN()-1)/31.001)+1,ROUNDUP(MOD(COLUMN()-1,31.001),0)),Feriados,0))),(VLOOKUP(VLOOKUP(WEEKDAY(DATE($A$7,INT((COLUMN()-1)/31.001)+1,ROUNDUP(MOD(COLUMN()-1,31.001),0)),2),Auxiliar!$D$1:$E$7,2,0),'Feriados y días laborables'!$E$5:$F$11,2,0)=\"Si\"))","v":true},{"$f":"AND(NOT(ISNUMBER(MATCH(DATE($A$7,INT((COLUMN()-1)/31.001)+1,ROUNDUP(MOD(COLUMN()-1,31.001),0)),Feriados,0))),(VLOOKUP(VLOOKUP(WEEKDAY(DATE($A$7,INT((COLUMN()-1)/31.001)+1,ROUNDUP(MOD(COLUMN()-1,31.001),0)),2),Auxiliar!$D$1:$E$7,2,0),'Feriados y días laborables'!$E$5:$F$11,2,0)=\"Si\"))","v":true},{"$f":"AND(NOT(ISNUMBER(MATCH(DATE($A$7,INT((COLUMN()-1)/31.001)+1,ROUNDUP(MOD(COLUMN()-1,31.001),0)),Feriados,0))),(VLOOKUP(VLOOKUP(WEEKDAY(DATE($A$7,INT((COLUMN()-1)/31.001)+1,ROUNDUP(MOD(COLUMN()-1,31.001),0)),2),Auxiliar!$D$1:$E$7,2,0),'Feriados y días laborables'!$E$5:$F$11,2,0)=\"Si\"))","v":true},{"$f":"AND(NOT(ISNUMBER(MATCH(DATE($A$7,INT((COLUMN()-1)/31.001)+1,ROUNDUP(MOD(COLUMN()-1,31.001),0)),Feriados,0))),(VLOOKUP(VLOOKUP(WEEKDAY(DATE($A$7,INT((COLUMN()-1)/31.001)+1,ROUNDUP(MOD(COLUMN()-1,31.001),0)),2),Auxiliar!$D$1:$E$7,2,0),'Feriados y días laborables'!$E$5:$F$11,2,0)=\"Si\"))","v":false},{"$f":"AND(NOT(ISNUMBER(MATCH(DATE($A$7,INT((COLUMN()-1)/31.001)+1,ROUNDUP(MOD(COLUMN()-1,31.001),0)),Feriados,0))),(VLOOKUP(VLOOKUP(WEEKDAY(DATE($A$7,INT((COLUMN()-1)/31.001)+1,ROUNDUP(MOD(COLUMN()-1,31.001),0)),2),Auxiliar!$D$1:$E$7,2,0),'Feriados y días laborables'!$E$5:$F$11,2,0)=\"Si\"))","v":false},{"$f":"AND(NOT(ISNUMBER(MATCH(DATE($A$7,INT((COLUMN()-1)/31.001)+1,ROUNDUP(MOD(COLUMN()-1,31.001),0)),Feriados,0))),(VLOOKUP(VLOOKUP(WEEKDAY(DATE($A$7,INT((COLUMN()-1)/31.001)+1,ROUNDUP(MOD(COLUMN()-1,31.001),0)),2),Auxiliar!$D$1:$E$7,2,0),'Feriados y días laborables'!$E$5:$F$11,2,0)=\"Si\"))","v":true},{"$f":"AND(NOT(ISNUMBER(MATCH(DATE($A$7,INT((COLUMN()-1)/31.001)+1,ROUNDUP(MOD(COLUMN()-1,31.001),0)),Feriados,0))),(VLOOKUP(VLOOKUP(WEEKDAY(DATE($A$7,INT((COLUMN()-1)/31.001)+1,ROUNDUP(MOD(COLUMN()-1,31.001),0)),2),Auxiliar!$D$1:$E$7,2,0),'Feriados y días laborables'!$E$5:$F$11,2,0)=\"Si\"))","v":true},{"$f":"AND(NOT(ISNUMBER(MATCH(DATE($A$7,INT((COLUMN()-1)/31.001)+1,ROUNDUP(MOD(COLUMN()-1,31.001),0)),Feriados,0))),(VLOOKUP(VLOOKUP(WEEKDAY(DATE($A$7,INT((COLUMN()-1)/31.001)+1,ROUNDUP(MOD(COLUMN()-1,31.001),0)),2),Auxiliar!$D$1:$E$7,2,0),'Feriados y días laborables'!$E$5:$F$11,2,0)=\"Si\"))","v":true},{"$f":"AND(NOT(ISNUMBER(MATCH(DATE($A$7,INT((COLUMN()-1)/31.001)+1,ROUNDUP(MOD(COLUMN()-1,31.001),0)),Feriados,0))),(VLOOKUP(VLOOKUP(WEEKDAY(DATE($A$7,INT((COLUMN()-1)/31.001)+1,ROUNDUP(MOD(COLUMN()-1,31.001),0)),2),Auxiliar!$D$1:$E$7,2,0),'Feriados y días laborables'!$E$5:$F$11,2,0)=\"Si\"))","v":true},{"$f":"AND(NOT(ISNUMBER(MATCH(DATE($A$7,INT((COLUMN()-1)/31.001)+1,ROUNDUP(MOD(COLUMN()-1,31.001),0)),Feriados,0))),(VLOOKUP(VLOOKUP(WEEKDAY(DATE($A$7,INT((COLUMN()-1)/31.001)+1,ROUNDUP(MOD(COLUMN()-1,31.001),0)),2),Auxiliar!$D$1:$E$7,2,0),'Feriados y días laborables'!$E$5:$F$11,2,0)=\"Si\"))","v":true},{"$f":"AND(NOT(ISNUMBER(MATCH(DATE($A$7,INT((COLUMN()-1)/31.001)+1,ROUNDUP(MOD(COLUMN()-1,31.001),0)),Feriados,0))),(VLOOKUP(VLOOKUP(WEEKDAY(DATE($A$7,INT((COLUMN()-1)/31.001)+1,ROUNDUP(MOD(COLUMN()-1,31.001),0)),2),Auxiliar!$D$1:$E$7,2,0),'Feriados y días laborables'!$E$5:$F$11,2,0)=\"Si\"))","v":false},{"$f":"AND(NOT(ISNUMBER(MATCH(DATE($A$7,INT((COLUMN()-1)/31.001)+1,ROUNDUP(MOD(COLUMN()-1,31.001),0)),Feriados,0))),(VLOOKUP(VLOOKUP(WEEKDAY(DATE($A$7,INT((COLUMN()-1)/31.001)+1,ROUNDUP(MOD(COLUMN()-1,31.001),0)),2),Auxiliar!$D$1:$E$7,2,0),'Feriados y días laborables'!$E$5:$F$11,2,0)=\"Si\"))","v":false},{"$f":"AND(NOT(ISNUMBER(MATCH(DATE($A$7,INT((COLUMN()-1)/31.001)+1,ROUNDUP(MOD(COLUMN()-1,31.001),0)),Feriados,0))),(VLOOKUP(VLOOKUP(WEEKDAY(DATE($A$7,INT((COLUMN()-1)/31.001)+1,ROUNDUP(MOD(COLUMN()-1,31.001),0)),2),Auxiliar!$D$1:$E$7,2,0),'Feriados y días laborables'!$E$5:$F$11,2,0)=\"Si\"))","v":true},{"$f":"AND(NOT(ISNUMBER(MATCH(DATE($A$7,INT((COLUMN()-1)/31.001)+1,ROUNDUP(MOD(COLUMN()-1,31.001),0)),Feriados,0))),(VLOOKUP(VLOOKUP(WEEKDAY(DATE($A$7,INT((COLUMN()-1)/31.001)+1,ROUNDUP(MOD(COLUMN()-1,31.001),0)),2),Auxiliar!$D$1:$E$7,2,0),'Feriados y días laborables'!$E$5:$F$11,2,0)=\"Si\"))","v":true},{"$f":"AND(NOT(ISNUMBER(MATCH(DATE($A$7,INT((COLUMN()-1)/31.001)+1,ROUNDUP(MOD(COLUMN()-1,31.001),0)),Feriados,0))),(VLOOKUP(VLOOKUP(WEEKDAY(DATE($A$7,INT((COLUMN()-1)/31.001)+1,ROUNDUP(MOD(COLUMN()-1,31.001),0)),2),Auxiliar!$D$1:$E$7,2,0),'Feriados y días laborables'!$E$5:$F$11,2,0)=\"Si\"))","v":true},{"$f":"AND(NOT(ISNUMBER(MATCH(DATE($A$7,INT((COLUMN()-1)/31.001)+1,ROUNDUP(MOD(COLUMN()-1,31.001),0)),Feriados,0))),(VLOOKUP(VLOOKUP(WEEKDAY(DATE($A$7,INT((COLUMN()-1)/31.001)+1,ROUNDUP(MOD(COLUMN()-1,31.001),0)),2),Auxiliar!$D$1:$E$7,2,0),'Feriados y días laborables'!$E$5:$F$11,2,0)=\"Si\"))","v":true},{"$f":"AND(NOT(ISNUMBER(MATCH(DATE($A$7,INT((COLUMN()-1)/31.001)+1,ROUNDUP(MOD(COLUMN()-1,31.001),0)),Feriados,0))),(VLOOKUP(VLOOKUP(WEEKDAY(DATE($A$7,INT((COLUMN()-1)/31.001)+1,ROUNDUP(MOD(COLUMN()-1,31.001),0)),2),Auxiliar!$D$1:$E$7,2,0),'Feriados y días laborables'!$E$5:$F$11,2,0)=\"Si\"))","v":true},{"$f":"AND(NOT(ISNUMBER(MATCH(DATE($A$7,INT((COLUMN()-1)/31.001)+1,ROUNDUP(MOD(COLUMN()-1,31.001),0)),Feriados,0))),(VLOOKUP(VLOOKUP(WEEKDAY(DATE($A$7,INT((COLUMN()-1)/31.001)+1,ROUNDUP(MOD(COLUMN()-1,31.001),0)),2),Auxiliar!$D$1:$E$7,2,0),'Feriados y días laborables'!$E$5:$F$11,2,0)=\"Si\"))","v":false},{"$f":"AND(NOT(ISNUMBER(MATCH(DATE($A$7,INT((COLUMN()-1)/31.001)+1,ROUNDUP(MOD(COLUMN()-1,31.001),0)),Feriados,0))),(VLOOKUP(VLOOKUP(WEEKDAY(DATE($A$7,INT((COLUMN()-1)/31.001)+1,ROUNDUP(MOD(COLUMN()-1,31.001),0)),2),Auxiliar!$D$1:$E$7,2,0),'Feriados y días laborables'!$E$5:$F$11,2,0)=\"Si\"))","v":false},{"$f":"AND(NOT(ISNUMBER(MATCH(DATE($A$7,INT((COLUMN()-1)/31.001)+1,ROUNDUP(MOD(COLUMN()-1,31.001),0)),Feriados,0))),(VLOOKUP(VLOOKUP(WEEKDAY(DATE($A$7,INT((COLUMN()-1)/31.001)+1,ROUNDUP(MOD(COLUMN()-1,31.001),0)),2),Auxiliar!$D$1:$E$7,2,0),'Feriados y días laborables'!$E$5:$F$11,2,0)=\"Si\"))","v":true},{"$f":"AND(NOT(ISNUMBER(MATCH(DATE($A$7,INT((COLUMN()-1)/31.001)+1,ROUNDUP(MOD(COLUMN()-1,31.001),0)),Feriados,0))),(VLOOKUP(VLOOKUP(WEEKDAY(DATE($A$7,INT((COLUMN()-1)/31.001)+1,ROUNDUP(MOD(COLUMN()-1,31.001),0)),2),Auxiliar!$D$1:$E$7,2,0),'Feriados y días laborables'!$E$5:$F$11,2,0)=\"Si\"))","v":true},{"$f":"AND(NOT(ISNUMBER(MATCH(DATE($A$7,INT((COLUMN()-1)/31.001)+1,ROUNDUP(MOD(COLUMN()-1,31.001),0)),Feriados,0))),(VLOOKUP(VLOOKUP(WEEKDAY(DATE($A$7,INT((COLUMN()-1)/31.001)+1,ROUNDUP(MOD(COLUMN()-1,31.001),0)),2),Auxiliar!$D$1:$E$7,2,0),'Feriados y días laborables'!$E$5:$F$11,2,0)=\"Si\"))","v":true},{"$f":"AND(NOT(ISNUMBER(MATCH(DATE($A$7,INT((COLUMN()-1)/31.001)+1,ROUNDUP(MOD(COLUMN()-1,31.001),0)),Feriados,0))),(VLOOKUP(VLOOKUP(WEEKDAY(DATE($A$7,INT((COLUMN()-1)/31.001)+1,ROUNDUP(MOD(COLUMN()-1,31.001),0)),2),Auxiliar!$D$1:$E$7,2,0),'Feriados y días laborables'!$E$5:$F$11,2,0)=\"Si\"))","v":true},{"$f":"AND(NOT(ISNUMBER(MATCH(DATE($A$7,INT((COLUMN()-1)/31.001)+1,ROUNDUP(MOD(COLUMN()-1,31.001),0)),Feriados,0))),(VLOOKUP(VLOOKUP(WEEKDAY(DATE($A$7,INT((COLUMN()-1)/31.001)+1,ROUNDUP(MOD(COLUMN()-1,31.001),0)),2),Auxiliar!$D$1:$E$7,2,0),'Feriados y días laborables'!$E$5:$F$11,2,0)=\"Si\"))","v":true},{"$f":"AND(NOT(ISNUMBER(MATCH(DATE($A$7,INT((COLUMN()-1)/31.001)+1,ROUNDUP(MOD(COLUMN()-1,31.001),0)),Feriados,0))),(VLOOKUP(VLOOKUP(WEEKDAY(DATE($A$7,INT((COLUMN()-1)/31.001)+1,ROUNDUP(MOD(COLUMN()-1,31.001),0)),2),Auxiliar!$D$1:$E$7,2,0),'Feriados y días laborables'!$E$5:$F$11,2,0)=\"Si\"))","v":false},{"$f":"AND(NOT(ISNUMBER(MATCH(DATE($A$7,INT((COLUMN()-1)/31.001)+1,ROUNDUP(MOD(COLUMN()-1,31.001),0)),Feriados,0))),(VLOOKUP(VLOOKUP(WEEKDAY(DATE($A$7,INT((COLUMN()-1)/31.001)+1,ROUNDUP(MOD(COLUMN()-1,31.001),0)),2),Auxiliar!$D$1:$E$7,2,0),'Feriados y días laborables'!$E$5:$F$11,2,0)=\"Si\"))","v":false},{"$f":"AND(NOT(ISNUMBER(MATCH(DATE($A$7,INT((COLUMN()-1)/31.001)+1,ROUNDUP(MOD(COLUMN()-1,31.001),0)),Feriados,0))),(VLOOKUP(VLOOKUP(WEEKDAY(DATE($A$7,INT((COLUMN()-1)/31.001)+1,ROUNDUP(MOD(COLUMN()-1,31.001),0)),2),Auxiliar!$D$1:$E$7,2,0),'Feriados y días laborables'!$E$5:$F$11,2,0)=\"Si\"))","v":true},{"$f":"AND(NOT(ISNUMBER(MATCH(DATE($A$7,INT((COLUMN()-1)/31.001)+1,ROUNDUP(MOD(COLUMN()-1,31.001),0)),Feriados,0))),(VLOOKUP(VLOOKUP(WEEKDAY(DATE($A$7,INT((COLUMN()-1)/31.001)+1,ROUNDUP(MOD(COLUMN()-1,31.001),0)),2),Auxiliar!$D$1:$E$7,2,0),'Feriados y días laborables'!$E$5:$F$11,2,0)=\"Si\"))","v":true},{"$f":"AND(NOT(ISNUMBER(MATCH(DATE($A$7,INT((COLUMN()-1)/31.001)+1,ROUNDUP(MOD(COLUMN()-1,31.001),0)),Feriados,0))),(VLOOKUP(VLOOKUP(WEEKDAY(DATE($A$7,INT((COLUMN()-1)/31.001)+1,ROUNDUP(MOD(COLUMN()-1,31.001),0)),2),Auxiliar!$D$1:$E$7,2,0),'Feriados y días laborables'!$E$5:$F$11,2,0)=\"Si\"))","v":true},{"$f":"AND(NOT(ISNUMBER(MATCH(DATE($A$7,INT((COLUMN()-1)/31.001)+1,ROUNDUP(MOD(COLUMN()-1,31.001),0)),Feriados,0))),(VLOOKUP(VLOOKUP(WEEKDAY(DATE($A$7,INT((COLUMN()-1)/31.001)+1,ROUNDUP(MOD(COLUMN()-1,31.001),0)),2),Auxiliar!$D$1:$E$7,2,0),'Feriados y días laborables'!$E$5:$F$11,2,0)=\"Si\"))","v":true},{"$f":"AND(NOT(ISNUMBER(MATCH(DATE($A$7,INT((COLUMN()-1)/31.001)+1,ROUNDUP(MOD(COLUMN()-1,31.001),0)),Feriados,0))),(VLOOKUP(VLOOKUP(WEEKDAY(DATE($A$7,INT((COLUMN()-1)/31.001)+1,ROUNDUP(MOD(COLUMN()-1,31.001),0)),2),Auxiliar!$D$1:$E$7,2,0),'Feriados y días laborables'!$E$5:$F$11,2,0)=\"Si\"))","v":true},{"$f":"AND(NOT(ISNUMBER(MATCH(DATE($A$7,INT((COLUMN()-1)/31.001)+1,ROUNDUP(MOD(COLUMN()-1,31.001),0)),Feriados,0))),(VLOOKUP(VLOOKUP(WEEKDAY(DATE($A$7,INT((COLUMN()-1)/31.001)+1,ROUNDUP(MOD(COLUMN()-1,31.001),0)),2),Auxiliar!$D$1:$E$7,2,0),'Feriados y días laborables'!$E$5:$F$11,2,0)=\"Si\"))","v":false},{"$f":"AND(NOT(ISNUMBER(MATCH(DATE($A$7,INT((COLUMN()-1)/31.001)+1,ROUNDUP(MOD(COLUMN()-1,31.001),0)),Feriados,0))),(VLOOKUP(VLOOKUP(WEEKDAY(DATE($A$7,INT((COLUMN()-1)/31.001)+1,ROUNDUP(MOD(COLUMN()-1,31.001),0)),2),Auxiliar!$D$1:$E$7,2,0),'Feriados y días laborables'!$E$5:$F$11,2,0)=\"Si\"))","v":false},{"$f":"AND(NOT(ISNUMBER(MATCH(DATE($A$7,INT((COLUMN()-1)/31.001)+1,ROUNDUP(MOD(COLUMN()-1,31.001),0)),Feriados,0))),(VLOOKUP(VLOOKUP(WEEKDAY(DATE($A$7,INT((COLUMN()-1)/31.001)+1,ROUNDUP(MOD(COLUMN()-1,31.001),0)),2),Auxiliar!$D$1:$E$7,2,0),'Feriados y días laborables'!$E$5:$F$11,2,0)=\"Si\"))","v":true},{"$f":"AND(NOT(ISNUMBER(MATCH(DATE($A$7,INT((COLUMN()-1)/31.001)+1,ROUNDUP(MOD(COLUMN()-1,31.001),0)),Feriados,0))),(VLOOKUP(VLOOKUP(WEEKDAY(DATE($A$7,INT((COLUMN()-1)/31.001)+1,ROUNDUP(MOD(COLUMN()-1,31.001),0)),2),Auxiliar!$D$1:$E$7,2,0),'Feriados y días laborables'!$E$5:$F$11,2,0)=\"Si\"))","v":true},{"$f":"AND(NOT(ISNUMBER(MATCH(DATE($A$7,INT((COLUMN()-1)/31.001)+1,ROUNDUP(MOD(COLUMN()-1,31.001),0)),Feriados,0))),(VLOOKUP(VLOOKUP(WEEKDAY(DATE($A$7,INT((COLUMN()-1)/31.001)+1,ROUNDUP(MOD(COLUMN()-1,31.001),0)),2),Auxiliar!$D$1:$E$7,2,0),'Feriados y días laborables'!$E$5:$F$11,2,0)=\"Si\"))","v":true},{"$f":"AND(NOT(ISNUMBER(MATCH(DATE($A$7,INT((COLUMN()-1)/31.001)+1,ROUNDUP(MOD(COLUMN()-1,31.001),0)),Feriados,0))),(VLOOKUP(VLOOKUP(WEEKDAY(DATE($A$7,INT((COLUMN()-1)/31.001)+1,ROUNDUP(MOD(COLUMN()-1,31.001),0)),2),Auxiliar!$D$1:$E$7,2,0),'Feriados y días laborables'!$E$5:$F$11,2,0)=\"Si\"))","v":true},{"$f":"AND(NOT(ISNUMBER(MATCH(DATE($A$7,INT((COLUMN()-1)/31.001)+1,ROUNDUP(MOD(COLUMN()-1,31.001),0)),Feriados,0))),(VLOOKUP(VLOOKUP(WEEKDAY(DATE($A$7,INT((COLUMN()-1)/31.001)+1,ROUNDUP(MOD(COLUMN()-1,31.001),0)),2),Auxiliar!$D$1:$E$7,2,0),'Feriados y días laborables'!$E$5:$F$11,2,0)=\"Si\"))","v":true},{"$f":"AND(NOT(ISNUMBER(MATCH(DATE($A$7,INT((COLUMN()-1)/31.001)+1,ROUNDUP(MOD(COLUMN()-1,31.001),0)),Feriados,0))),(VLOOKUP(VLOOKUP(WEEKDAY(DATE($A$7,INT((COLUMN()-1)/31.001)+1,ROUNDUP(MOD(COLUMN()-1,31.001),0)),2),Auxiliar!$D$1:$E$7,2,0),'Feriados y días laborables'!$E$5:$F$11,2,0)=\"Si\"))","v":false},{"$f":"AND(NOT(ISNUMBER(MATCH(DATE($A$7,INT((COLUMN()-1)/31.001)+1,ROUNDUP(MOD(COLUMN()-1,31.001),0)),Feriados,0))),(VLOOKUP(VLOOKUP(WEEKDAY(DATE($A$7,INT((COLUMN()-1)/31.001)+1,ROUNDUP(MOD(COLUMN()-1,31.001),0)),2),Auxiliar!$D$1:$E$7,2,0),'Feriados y días laborables'!$E$5:$F$11,2,0)=\"Si\"))","v":false},{"$f":"AND(NOT(ISNUMBER(MATCH(DATE($A$7,INT((COLUMN()-1)/31.001)+1,ROUNDUP(MOD(COLUMN()-1,31.001),0)),Feriados,0))),(VLOOKUP(VLOOKUP(WEEKDAY(DATE($A$7,INT((COLUMN()-1)/31.001)+1,ROUNDUP(MOD(COLUMN()-1,31.001),0)),2),Auxiliar!$D$1:$E$7,2,0),'Feriados y días laborables'!$E$5:$F$11,2,0)=\"Si\"))","v":true},{"$f":"AND(NOT(ISNUMBER(MATCH(DATE($A$7,INT((COLUMN()-1)/31.001)+1,ROUNDUP(MOD(COLUMN()-1,31.001),0)),Feriados,0))),(VLOOKUP(VLOOKUP(WEEKDAY(DATE($A$7,INT((COLUMN()-1)/31.001)+1,ROUNDUP(MOD(COLUMN()-1,31.001),0)),2),Auxiliar!$D$1:$E$7,2,0),'Feriados y días laborables'!$E$5:$F$11,2,0)=\"Si\"))","v":true},{"$f":"AND(NOT(ISNUMBER(MATCH(DATE($A$7,INT((COLUMN()-1)/31.001)+1,ROUNDUP(MOD(COLUMN()-1,31.001),0)),Feriados,0))),(VLOOKUP(VLOOKUP(WEEKDAY(DATE($A$7,INT((COLUMN()-1)/31.001)+1,ROUNDUP(MOD(COLUMN()-1,31.001),0)),2),Auxiliar!$D$1:$E$7,2,0),'Feriados y días laborables'!$E$5:$F$11,2,0)=\"Si\"))","v":true},{"$f":"AND(NOT(ISNUMBER(MATCH(DATE($A$7,INT((COLUMN()-1)/31.001)+1,ROUNDUP(MOD(COLUMN()-1,31.001),0)),Feriados,0))),(VLOOKUP(VLOOKUP(WEEKDAY(DATE($A$7,INT((COLUMN()-1)/31.001)+1,ROUNDUP(MOD(COLUMN()-1,31.001),0)),2),Auxiliar!$D$1:$E$7,2,0),'Feriados y días laborables'!$E$5:$F$11,2,0)=\"Si\"))","v":true},{"$f":"AND(NOT(ISNUMBER(MATCH(DATE($A$7,INT((COLUMN()-1)/31.001)+1,ROUNDUP(MOD(COLUMN()-1,31.001),0)),Feriados,0))),(VLOOKUP(VLOOKUP(WEEKDAY(DATE($A$7,INT((COLUMN()-1)/31.001)+1,ROUNDUP(MOD(COLUMN()-1,31.001),0)),2),Auxiliar!$D$1:$E$7,2,0),'Feriados y días laborables'!$E$5:$F$11,2,0)=\"Si\"))","v":true},{"$f":"AND(NOT(ISNUMBER(MATCH(DATE($A$7,INT((COLUMN()-1)/31.001)+1,ROUNDUP(MOD(COLUMN()-1,31.001),0)),Feriados,0))),(VLOOKUP(VLOOKUP(WEEKDAY(DATE($A$7,INT((COLUMN()-1)/31.001)+1,ROUNDUP(MOD(COLUMN()-1,31.001),0)),2),Auxiliar!$D$1:$E$7,2,0),'Feriados y días laborables'!$E$5:$F$11,2,0)=\"Si\"))","v":false},{"$f":"AND(NOT(ISNUMBER(MATCH(DATE($A$7,INT((COLUMN()-1)/31.001)+1,ROUNDUP(MOD(COLUMN()-1,31.001),0)),Feriados,0))),(VLOOKUP(VLOOKUP(WEEKDAY(DATE($A$7,INT((COLUMN()-1)/31.001)+1,ROUNDUP(MOD(COLUMN()-1,31.001),0)),2),Auxiliar!$D$1:$E$7,2,0),'Feriados y días laborables'!$E$5:$F$11,2,0)=\"Si\"))","v":false},{"$f":"AND(NOT(ISNUMBER(MATCH(DATE($A$7,INT((COLUMN()-1)/31.001)+1,ROUNDUP(MOD(COLUMN()-1,31.001),0)),Feriados,0))),(VLOOKUP(VLOOKUP(WEEKDAY(DATE($A$7,INT((COLUMN()-1)/31.001)+1,ROUNDUP(MOD(COLUMN()-1,31.001),0)),2),Auxiliar!$D$1:$E$7,2,0),'Feriados y días laborables'!$E$5:$F$11,2,0)=\"Si\"))","v":true},{"$f":"AND(NOT(ISNUMBER(MATCH(DATE($A$7,INT((COLUMN()-1)/31.001)+1,ROUNDUP(MOD(COLUMN()-1,31.001),0)),Feriados,0))),(VLOOKUP(VLOOKUP(WEEKDAY(DATE($A$7,INT((COLUMN()-1)/31.001)+1,ROUNDUP(MOD(COLUMN()-1,31.001),0)),2),Auxiliar!$D$1:$E$7,2,0),'Feriados y días laborables'!$E$5:$F$11,2,0)=\"Si\"))","v":true},{"$f":"AND(NOT(ISNUMBER(MATCH(DATE($A$7,INT((COLUMN()-1)/31.001)+1,ROUNDUP(MOD(COLUMN()-1,31.001),0)),Feriados,0))),(VLOOKUP(VLOOKUP(WEEKDAY(DATE($A$7,INT((COLUMN()-1)/31.001)+1,ROUNDUP(MOD(COLUMN()-1,31.001),0)),2),Auxiliar!$D$1:$E$7,2,0),'Feriados y días laborables'!$E$5:$F$11,2,0)=\"Si\"))","v":true},{"$f":"AND(NOT(ISNUMBER(MATCH(DATE($A$7,INT((COLUMN()-1)/31.001)+1,ROUNDUP(MOD(COLUMN()-1,31.001),0)),Feriados,0))),(VLOOKUP(VLOOKUP(WEEKDAY(DATE($A$7,INT((COLUMN()-1)/31.001)+1,ROUNDUP(MOD(COLUMN()-1,31.001),0)),2),Auxiliar!$D$1:$E$7,2,0),'Feriados y días laborables'!$E$5:$F$11,2,0)=\"Si\"))","v":true},{"$f":"AND(NOT(ISNUMBER(MATCH(DATE($A$7,INT((COLUMN()-1)/31.001)+1,ROUNDUP(MOD(COLUMN()-1,31.001),0)),Feriados,0))),(VLOOKUP(VLOOKUP(WEEKDAY(DATE($A$7,INT((COLUMN()-1)/31.001)+1,ROUNDUP(MOD(COLUMN()-1,31.001),0)),2),Auxiliar!$D$1:$E$7,2,0),'Feriados y días laborables'!$E$5:$F$11,2,0)=\"Si\"))","v":true},{"$f":"AND(NOT(ISNUMBER(MATCH(DATE($A$7,INT((COLUMN()-1)/31.001)+1,ROUNDUP(MOD(COLUMN()-1,31.001),0)),Feriados,0))),(VLOOKUP(VLOOKUP(WEEKDAY(DATE($A$7,INT((COLUMN()-1)/31.001)+1,ROUNDUP(MOD(COLUMN()-1,31.001),0)),2),Auxiliar!$D$1:$E$7,2,0),'Feriados y días laborables'!$E$5:$F$11,2,0)=\"Si\"))","v":false},{"$f":"AND(NOT(ISNUMBER(MATCH(DATE($A$7,INT((COLUMN()-1)/31.001)+1,ROUNDUP(MOD(COLUMN()-1,31.001),0)),Feriados,0))),(VLOOKUP(VLOOKUP(WEEKDAY(DATE($A$7,INT((COLUMN()-1)/31.001)+1,ROUNDUP(MOD(COLUMN()-1,31.001),0)),2),Auxiliar!$D$1:$E$7,2,0),'Feriados y días laborables'!$E$5:$F$11,2,0)=\"Si\"))","v":false},{"$f":"AND(NOT(ISNUMBER(MATCH(DATE($A$7,INT((COLUMN()-1)/31.001)+1,ROUNDUP(MOD(COLUMN()-1,31.001),0)),Feriados,0))),(VLOOKUP(VLOOKUP(WEEKDAY(DATE($A$7,INT((COLUMN()-1)/31.001)+1,ROUNDUP(MOD(COLUMN()-1,31.001),0)),2),Auxiliar!$D$1:$E$7,2,0),'Feriados y días laborables'!$E$5:$F$11,2,0)=\"Si\"))","v":true},{"$f":"AND(NOT(ISNUMBER(MATCH(DATE($A$7,INT((COLUMN()-1)/31.001)+1,ROUNDUP(MOD(COLUMN()-1,31.001),0)),Feriados,0))),(VLOOKUP(VLOOKUP(WEEKDAY(DATE($A$7,INT((COLUMN()-1)/31.001)+1,ROUNDUP(MOD(COLUMN()-1,31.001),0)),2),Auxiliar!$D$1:$E$7,2,0),'Feriados y días laborables'!$E$5:$F$11,2,0)=\"Si\"))","v":true},{"$f":"AND(NOT(ISNUMBER(MATCH(DATE($A$7,INT((COLUMN()-1)/31.001)+1,ROUNDUP(MOD(COLUMN()-1,31.001),0)),Feriados,0))),(VLOOKUP(VLOOKUP(WEEKDAY(DATE($A$7,INT((COLUMN()-1)/31.001)+1,ROUNDUP(MOD(COLUMN()-1,31.001),0)),2),Auxiliar!$D$1:$E$7,2,0),'Feriados y días laborables'!$E$5:$F$11,2,0)=\"Si\"))","v":true},{"$f":"AND(NOT(ISNUMBER(MATCH(DATE($A$7,INT((COLUMN()-1)/31.001)+1,ROUNDUP(MOD(COLUMN()-1,31.001),0)),Feriados,0))),(VLOOKUP(VLOOKUP(WEEKDAY(DATE($A$7,INT((COLUMN()-1)/31.001)+1,ROUNDUP(MOD(COLUMN()-1,31.001),0)),2),Auxiliar!$D$1:$E$7,2,0),'Feriados y días laborables'!$E$5:$F$11,2,0)=\"Si\"))","v":true},{"$f":"AND(NOT(ISNUMBER(MATCH(DATE($A$7,INT((COLUMN()-1)/31.001)+1,ROUNDUP(MOD(COLUMN()-1,31.001),0)),Feriados,0))),(VLOOKUP(VLOOKUP(WEEKDAY(DATE($A$7,INT((COLUMN()-1)/31.001)+1,ROUNDUP(MOD(COLUMN()-1,31.001),0)),2),Auxiliar!$D$1:$E$7,2,0),'Feriados y días laborables'!$E$5:$F$11,2,0)=\"Si\"))","v":true},{"$f":"AND(NOT(ISNUMBER(MATCH(DATE($A$7,INT((COLUMN()-1)/31.001)+1,ROUNDUP(MOD(COLUMN()-1,31.001),0)),Feriados,0))),(VLOOKUP(VLOOKUP(WEEKDAY(DATE($A$7,INT((COLUMN()-1)/31.001)+1,ROUNDUP(MOD(COLUMN()-1,31.001),0)),2),Auxiliar!$D$1:$E$7,2,0),'Feriados y días laborables'!$E$5:$F$11,2,0)=\"Si\"))","v":false},{"$f":"AND(NOT(ISNUMBER(MATCH(DATE($A$7,INT((COLUMN()-1)/31.001)+1,ROUNDUP(MOD(COLUMN()-1,31.001),0)),Feriados,0))),(VLOOKUP(VLOOKUP(WEEKDAY(DATE($A$7,INT((COLUMN()-1)/31.001)+1,ROUNDUP(MOD(COLUMN()-1,31.001),0)),2),Auxiliar!$D$1:$E$7,2,0),'Feriados y días laborables'!$E$5:$F$11,2,0)=\"Si\"))","v":false},{"$f":"AND(NOT(ISNUMBER(MATCH(DATE($A$7,INT((COLUMN()-1)/31.001)+1,ROUNDUP(MOD(COLUMN()-1,31.001),0)),Feriados,0))),(VLOOKUP(VLOOKUP(WEEKDAY(DATE($A$7,INT((COLUMN()-1)/31.001)+1,ROUNDUP(MOD(COLUMN()-1,31.001),0)),2),Auxiliar!$D$1:$E$7,2,0),'Feriados y días laborables'!$E$5:$F$11,2,0)=\"Si\"))","v":true},{"$f":"AND(NOT(ISNUMBER(MATCH(DATE($A$7,INT((COLUMN()-1)/31.001)+1,ROUNDUP(MOD(COLUMN()-1,31.001),0)),Feriados,0))),(VLOOKUP(VLOOKUP(WEEKDAY(DATE($A$7,INT((COLUMN()-1)/31.001)+1,ROUNDUP(MOD(COLUMN()-1,31.001),0)),2),Auxiliar!$D$1:$E$7,2,0),'Feriados y días laborables'!$E$5:$F$11,2,0)=\"Si\"))","v":true},{"$f":"AND(NOT(ISNUMBER(MATCH(DATE($A$7,INT((COLUMN()-1)/31.001)+1,ROUNDUP(MOD(COLUMN()-1,31.001),0)),Feriados,0))),(VLOOKUP(VLOOKUP(WEEKDAY(DATE($A$7,INT((COLUMN()-1)/31.001)+1,ROUNDUP(MOD(COLUMN()-1,31.001),0)),2),Auxiliar!$D$1:$E$7,2,0),'Feriados y días laborables'!$E$5:$F$11,2,0)=\"Si\"))","v":true},{"$f":"AND(NOT(ISNUMBER(MATCH(DATE($A$7,INT((COLUMN()-1)/31.001)+1,ROUNDUP(MOD(COLUMN()-1,31.001),0)),Feriados,0))),(VLOOKUP(VLOOKUP(WEEKDAY(DATE($A$7,INT((COLUMN()-1)/31.001)+1,ROUNDUP(MOD(COLUMN()-1,31.001),0)),2),Auxiliar!$D$1:$E$7,2,0),'Feriados y días laborables'!$E$5:$F$11,2,0)=\"Si\"))","v":true},{"$f":"AND(NOT(ISNUMBER(MATCH(DATE($A$7,INT((COLUMN()-1)/31.001)+1,ROUNDUP(MOD(COLUMN()-1,31.001),0)),Feriados,0))),(VLOOKUP(VLOOKUP(WEEKDAY(DATE($A$7,INT((COLUMN()-1)/31.001)+1,ROUNDUP(MOD(COLUMN()-1,31.001),0)),2),Auxiliar!$D$1:$E$7,2,0),'Feriados y días laborables'!$E$5:$F$11,2,0)=\"Si\"))","v":true},{"$f":"AND(NOT(ISNUMBER(MATCH(DATE($A$7,INT((COLUMN()-1)/31.001)+1,ROUNDUP(MOD(COLUMN()-1,31.001),0)),Feriados,0))),(VLOOKUP(VLOOKUP(WEEKDAY(DATE($A$7,INT((COLUMN()-1)/31.001)+1,ROUNDUP(MOD(COLUMN()-1,31.001),0)),2),Auxiliar!$D$1:$E$7,2,0),'Feriados y días laborables'!$E$5:$F$11,2,0)=\"Si\"))","v":true},{"$f":"AND(NOT(ISNUMBER(MATCH(DATE($A$7,INT((COLUMN()-1)/31.001)+1,ROUNDUP(MOD(COLUMN()-1,31.001),0)),Feriados,0))),(VLOOKUP(VLOOKUP(WEEKDAY(DATE($A$7,INT((COLUMN()-1)/31.001)+1,ROUNDUP(MOD(COLUMN()-1,31.001),0)),2),Auxiliar!$D$1:$E$7,2,0),'Feriados y días laborables'!$E$5:$F$11,2,0)=\"Si\"))","v":false},{"$f":"AND(NOT(ISNUMBER(MATCH(DATE($A$7,INT((COLUMN()-1)/31.001)+1,ROUNDUP(MOD(COLUMN()-1,31.001),0)),Feriados,0))),(VLOOKUP(VLOOKUP(WEEKDAY(DATE($A$7,INT((COLUMN()-1)/31.001)+1,ROUNDUP(MOD(COLUMN()-1,31.001),0)),2),Auxiliar!$D$1:$E$7,2,0),'Feriados y días laborables'!$E$5:$F$11,2,0)=\"Si\"))","v":false},{"$f":"AND(NOT(ISNUMBER(MATCH(DATE($A$7,INT((COLUMN()-1)/31.001)+1,ROUNDUP(MOD(COLUMN()-1,31.001),0)),Feriados,0))),(VLOOKUP(VLOOKUP(WEEKDAY(DATE($A$7,INT((COLUMN()-1)/31.001)+1,ROUNDUP(MOD(COLUMN()-1,31.001),0)),2),Auxiliar!$D$1:$E$7,2,0),'Feriados y días laborables'!$E$5:$F$11,2,0)=\"Si\"))","v":true},{"$f":"AND(NOT(ISNUMBER(MATCH(DATE($A$7,INT((COLUMN()-1)/31.001)+1,ROUNDUP(MOD(COLUMN()-1,31.001),0)),Feriados,0))),(VLOOKUP(VLOOKUP(WEEKDAY(DATE($A$7,INT((COLUMN()-1)/31.001)+1,ROUNDUP(MOD(COLUMN()-1,31.001),0)),2),Auxiliar!$D$1:$E$7,2,0),'Feriados y días laborables'!$E$5:$F$11,2,0)=\"Si\"))","v":true},{"$f":"AND(NOT(ISNUMBER(MATCH(DATE($A$7,INT((COLUMN()-1)/31.001)+1,ROUNDUP(MOD(COLUMN()-1,31.001),0)),Feriados,0))),(VLOOKUP(VLOOKUP(WEEKDAY(DATE($A$7,INT((COLUMN()-1)/31.001)+1,ROUNDUP(MOD(COLUMN()-1,31.001),0)),2),Auxiliar!$D$1:$E$7,2,0),'Feriados y días laborables'!$E$5:$F$11,2,0)=\"Si\"))","v":true},{"$f":"AND(NOT(ISNUMBER(MATCH(DATE($A$7,INT((COLUMN()-1)/31.001)+1,ROUNDUP(MOD(COLUMN()-1,31.001),0)),Feriados,0))),(VLOOKUP(VLOOKUP(WEEKDAY(DATE($A$7,INT((COLUMN()-1)/31.001)+1,ROUNDUP(MOD(COLUMN()-1,31.001),0)),2),Auxiliar!$D$1:$E$7,2,0),'Feriados y días laborables'!$E$5:$F$11,2,0)=\"Si\"))","v":true},{"$f":"AND(NOT(ISNUMBER(MATCH(DATE($A$7,INT((COLUMN()-1)/31.001)+1,ROUNDUP(MOD(COLUMN()-1,31.001),0)),Feriados,0))),(VLOOKUP(VLOOKUP(WEEKDAY(DATE($A$7,INT((COLUMN()-1)/31.001)+1,ROUNDUP(MOD(COLUMN()-1,31.001),0)),2),Auxiliar!$D$1:$E$7,2,0),'Feriados y días laborables'!$E$5:$F$11,2,0)=\"Si\"))","v":true},{"$f":"AND(NOT(ISNUMBER(MATCH(DATE($A$7,INT((COLUMN()-1)/31.001)+1,ROUNDUP(MOD(COLUMN()-1,31.001),0)),Feriados,0))),(VLOOKUP(VLOOKUP(WEEKDAY(DATE($A$7,INT((COLUMN()-1)/31.001)+1,ROUNDUP(MOD(COLUMN()-1,31.001),0)),2),Auxiliar!$D$1:$E$7,2,0),'Feriados y días laborables'!$E$5:$F$11,2,0)=\"Si\"))","v":false},{"$f":"AND(NOT(ISNUMBER(MATCH(DATE($A$7,INT((COLUMN()-1)/31.001)+1,ROUNDUP(MOD(COLUMN()-1,31.001),0)),Feriados,0))),(VLOOKUP(VLOOKUP(WEEKDAY(DATE($A$7,INT((COLUMN()-1)/31.001)+1,ROUNDUP(MOD(COLUMN()-1,31.001),0)),2),Auxiliar!$D$1:$E$7,2,0),'Feriados y días laborables'!$E$5:$F$11,2,0)=\"Si\"))","v":false},{"$f":"AND(NOT(ISNUMBER(MATCH(DATE($A$7,INT((COLUMN()-1)/31.001)+1,ROUNDUP(MOD(COLUMN()-1,31.001),0)),Feriados,0))),(VLOOKUP(VLOOKUP(WEEKDAY(DATE($A$7,INT((COLUMN()-1)/31.001)+1,ROUNDUP(MOD(COLUMN()-1,31.001),0)),2),Auxiliar!$D$1:$E$7,2,0),'Feriados y días laborables'!$E$5:$F$11,2,0)=\"Si\"))","v":true},{"$f":"AND(NOT(ISNUMBER(MATCH(DATE($A$7,INT((COLUMN()-1)/31.001)+1,ROUNDUP(MOD(COLUMN()-1,31.001),0)),Feriados,0))),(VLOOKUP(VLOOKUP(WEEKDAY(DATE($A$7,INT((COLUMN()-1)/31.001)+1,ROUNDUP(MOD(COLUMN()-1,31.001),0)),2),Auxiliar!$D$1:$E$7,2,0),'Feriados y días laborables'!$E$5:$F$11,2,0)=\"Si\"))","v":true},{"$f":"AND(NOT(ISNUMBER(MATCH(DATE($A$7,INT((COLUMN()-1)/31.001)+1,ROUNDUP(MOD(COLUMN()-1,31.001),0)),Feriados,0))),(VLOOKUP(VLOOKUP(WEEKDAY(DATE($A$7,INT((COLUMN()-1)/31.001)+1,ROUNDUP(MOD(COLUMN()-1,31.001),0)),2),Auxiliar!$D$1:$E$7,2,0),'Feriados y días laborables'!$E$5:$F$11,2,0)=\"Si\"))","v":true},{"$f":"AND(NOT(ISNUMBER(MATCH(DATE($A$7,INT((COLUMN()-1)/31.001)+1,ROUNDUP(MOD(COLUMN()-1,31.001),0)),Feriados,0))),(VLOOKUP(VLOOKUP(WEEKDAY(DATE($A$7,INT((COLUMN()-1)/31.001)+1,ROUNDUP(MOD(COLUMN()-1,31.001),0)),2),Auxiliar!$D$1:$E$7,2,0),'Feriados y días laborables'!$E$5:$F$11,2,0)=\"Si\"))","v":true},{"$f":"AND(NOT(ISNUMBER(MATCH(DATE($A$7,INT((COLUMN()-1)/31.001)+1,ROUNDUP(MOD(COLUMN()-1,31.001),0)),Feriados,0))),(VLOOKUP(VLOOKUP(WEEKDAY(DATE($A$7,INT((COLUMN()-1)/31.001)+1,ROUNDUP(MOD(COLUMN()-1,31.001),0)),2),Auxiliar!$D$1:$E$7,2,0),'Feriados y días laborables'!$E$5:$F$11,2,0)=\"Si\"))","v":true},{"$f":"AND(NOT(ISNUMBER(MATCH(DATE($A$7,INT((COLUMN()-1)/31.001)+1,ROUNDUP(MOD(COLUMN()-1,31.001),0)),Feriados,0))),(VLOOKUP(VLOOKUP(WEEKDAY(DATE($A$7,INT((COLUMN()-1)/31.001)+1,ROUNDUP(MOD(COLUMN()-1,31.001),0)),2),Auxiliar!$D$1:$E$7,2,0),'Feriados y días laborables'!$E$5:$F$11,2,0)=\"Si\"))","v":false},{"$f":"AND(NOT(ISNUMBER(MATCH(DATE($A$7,INT((COLUMN()-1)/31.001)+1,ROUNDUP(MOD(COLUMN()-1,31.001),0)),Feriados,0))),(VLOOKUP(VLOOKUP(WEEKDAY(DATE($A$7,INT((COLUMN()-1)/31.001)+1,ROUNDUP(MOD(COLUMN()-1,31.001),0)),2),Auxiliar!$D$1:$E$7,2,0),'Feriados y días laborables'!$E$5:$F$11,2,0)=\"Si\"))","v":false},{"$f":"AND(NOT(ISNUMBER(MATCH(DATE($A$7,INT((COLUMN()-1)/31.001)+1,ROUNDUP(MOD(COLUMN()-1,31.001),0)),Feriados,0))),(VLOOKUP(VLOOKUP(WEEKDAY(DATE($A$7,INT((COLUMN()-1)/31.001)+1,ROUNDUP(MOD(COLUMN()-1,31.001),0)),2),Auxiliar!$D$1:$E$7,2,0),'Feriados y días laborables'!$E$5:$F$11,2,0)=\"Si\"))","v":true},{"$f":"AND(NOT(ISNUMBER(MATCH(DATE($A$7,INT((COLUMN()-1)/31.001)+1,ROUNDUP(MOD(COLUMN()-1,31.001),0)),Feriados,0))),(VLOOKUP(VLOOKUP(WEEKDAY(DATE($A$7,INT((COLUMN()-1)/31.001)+1,ROUNDUP(MOD(COLUMN()-1,31.001),0)),2),Auxiliar!$D$1:$E$7,2,0),'Feriados y días laborables'!$E$5:$F$11,2,0)=\"Si\"))","v":true},{"$f":"AND(NOT(ISNUMBER(MATCH(DATE($A$7,INT((COLUMN()-1)/31.001)+1,ROUNDUP(MOD(COLUMN()-1,31.001),0)),Feriados,0))),(VLOOKUP(VLOOKUP(WEEKDAY(DATE($A$7,INT((COLUMN()-1)/31.001)+1,ROUNDUP(MOD(COLUMN()-1,31.001),0)),2),Auxiliar!$D$1:$E$7,2,0),'Feriados y días laborables'!$E$5:$F$11,2,0)=\"Si\"))","v":true},{"$f":"AND(NOT(ISNUMBER(MATCH(DATE($A$7,INT((COLUMN()-1)/31.001)+1,ROUNDUP(MOD(COLUMN()-1,31.001),0)),Feriados,0))),(VLOOKUP(VLOOKUP(WEEKDAY(DATE($A$7,INT((COLUMN()-1)/31.001)+1,ROUNDUP(MOD(COLUMN()-1,31.001),0)),2),Auxiliar!$D$1:$E$7,2,0),'Feriados y días laborables'!$E$5:$F$11,2,0)=\"Si\"))","v":true},{"$f":"AND(NOT(ISNUMBER(MATCH(DATE($A$7,INT((COLUMN()-1)/31.001)+1,ROUNDUP(MOD(COLUMN()-1,31.001),0)),Feriados,0))),(VLOOKUP(VLOOKUP(WEEKDAY(DATE($A$7,INT((COLUMN()-1)/31.001)+1,ROUNDUP(MOD(COLUMN()-1,31.001),0)),2),Auxiliar!$D$1:$E$7,2,0),'Feriados y días laborables'!$E$5:$F$11,2,0)=\"Si\"))","v":true},{"$f":"AND(NOT(ISNUMBER(MATCH(DATE($A$7,INT((COLUMN()-1)/31.001)+1,ROUNDUP(MOD(COLUMN()-1,31.001),0)),Feriados,0))),(VLOOKUP(VLOOKUP(WEEKDAY(DATE($A$7,INT((COLUMN()-1)/31.001)+1,ROUNDUP(MOD(COLUMN()-1,31.001),0)),2),Auxiliar!$D$1:$E$7,2,0),'Feriados y días laborables'!$E$5:$F$11,2,0)=\"Si\"))","v":false},{"$f":"AND(NOT(ISNUMBER(MATCH(DATE($A$7,INT((COLUMN()-1)/31.001)+1,ROUNDUP(MOD(COLUMN()-1,31.001),0)),Feriados,0))),(VLOOKUP(VLOOKUP(WEEKDAY(DATE($A$7,INT((COLUMN()-1)/31.001)+1,ROUNDUP(MOD(COLUMN()-1,31.001),0)),2),Auxiliar!$D$1:$E$7,2,0),'Feriados y días laborables'!$E$5:$F$11,2,0)=\"Si\"))","v":false},{"$f":"AND(NOT(ISNUMBER(MATCH(DATE($A$7,INT((COLUMN()-1)/31.001)+1,ROUNDUP(MOD(COLUMN()-1,31.001),0)),Feriados,0))),(VLOOKUP(VLOOKUP(WEEKDAY(DATE($A$7,INT((COLUMN()-1)/31.001)+1,ROUNDUP(MOD(COLUMN()-1,31.001),0)),2),Auxiliar!$D$1:$E$7,2,0),'Feriados y días laborables'!$E$5:$F$11,2,0)=\"Si\"))","v":true},{"$f":"AND(NOT(ISNUMBER(MATCH(DATE($A$7,INT((COLUMN()-1)/31.001)+1,ROUNDUP(MOD(COLUMN()-1,31.001),0)),Feriados,0))),(VLOOKUP(VLOOKUP(WEEKDAY(DATE($A$7,INT((COLUMN()-1)/31.001)+1,ROUNDUP(MOD(COLUMN()-1,31.001),0)),2),Auxiliar!$D$1:$E$7,2,0),'Feriados y días laborables'!$E$5:$F$11,2,0)=\"Si\"))","v":true},{"$f":"AND(NOT(ISNUMBER(MATCH(DATE($A$7,INT((COLUMN()-1)/31.001)+1,ROUNDUP(MOD(COLUMN()-1,31.001),0)),Feriados,0))),(VLOOKUP(VLOOKUP(WEEKDAY(DATE($A$7,INT((COLUMN()-1)/31.001)+1,ROUNDUP(MOD(COLUMN()-1,31.001),0)),2),Auxiliar!$D$1:$E$7,2,0),'Feriados y días laborables'!$E$5:$F$11,2,0)=\"Si\"))","v":true},{"$f":"AND(NOT(ISNUMBER(MATCH(DATE($A$7,INT((COLUMN()-1)/31.001)+1,ROUNDUP(MOD(COLUMN()-1,31.001),0)),Feriados,0))),(VLOOKUP(VLOOKUP(WEEKDAY(DATE($A$7,INT((COLUMN()-1)/31.001)+1,ROUNDUP(MOD(COLUMN()-1,31.001),0)),2),Auxiliar!$D$1:$E$7,2,0),'Feriados y días laborables'!$E$5:$F$11,2,0)=\"Si\"))","v":true},{"$f":"AND(NOT(ISNUMBER(MATCH(DATE($A$7,INT((COLUMN()-1)/31.001)+1,ROUNDUP(MOD(COLUMN()-1,31.001),0)),Feriados,0))),(VLOOKUP(VLOOKUP(WEEKDAY(DATE($A$7,INT((COLUMN()-1)/31.001)+1,ROUNDUP(MOD(COLUMN()-1,31.001),0)),2),Auxiliar!$D$1:$E$7,2,0),'Feriados y días laborables'!$E$5:$F$11,2,0)=\"Si\"))","v":true},null,"Medio-día","MD"]
[null,{"$f":"IFERROR(IF(AND(VLOOKUP(B12,'Feriados y días laborables'!$E$5:$F$11,2,0)=\"Si\",NOT(ISNUMBER(VLOOKUP(DATE($A$7,$A$9+1-1,B11),Feriados,1,0)))),TRUE,FALSE),FALSE)","v":true},{"$f":"IFERROR(IF(AND(VLOOKUP(C12,'Feriados y días laborables'!$E$5:$F$11,2,0)=\"Si\",NOT(ISNUMBER(VLOOKUP(DATE($A$7,$A$9+1-1,C11),Feriados,1,0)))),TRUE,FALSE),FALSE)","v":false},{"$f":"IFERROR(IF(AND(VLOOKUP(D12,'Feriados y días laborables'!$E$5:$F$11,2,0)=\"Si\",NOT(ISNUMBER(VLOOKUP(DATE($A$7,$A$9+1-1,D11),Feriados,1,0)))),TRUE,FALSE),FALSE)","v":false},{"$f":"IFERROR(IF(AND(VLOOKUP(E12,'Feriados y días laborables'!$E$5:$F$11,2,0)=\"Si\",NOT(ISNUMBER(VLOOKUP(DATE($A$7,$A$9+1-1,E11),Feriados,1,0)))),TRUE,FALSE),FALSE)","v":true},{"$f":"IFERROR(IF(AND(VLOOKUP(F12,'Feriados y días laborables'!$E$5:$F$11,2,0)=\"Si\",NOT(ISNUMBER(VLOOKUP(DATE($A$7,$A$9+1-1,F11),Feriados,1,0)))),TRUE,FALSE),FALSE)","v":true},{"$f":"IFERROR(IF(AND(VLOOKUP(G12,'Feriados y días laborables'!$E$5:$F$11,2,0)=\"Si\",NOT(ISNUMBER(VLOOKUP(DATE($A$7,$A$9+1-1,G11),Feriados,1,0)))),TRUE,FALSE),FALSE)","v":true},{"$f":"IFERROR(IF(AND(VLOOKUP(H12,'Feriados y días laborables'!$E$5:$F$11,2,0)=\"Si\",NOT(ISNUMBER(VLOOKUP(DATE($A$7,$A$9+1-1,H11),Feriados,1,0)))),TRUE,FALSE),FALSE)","v":true},{"$f":"IFERROR(IF(AND(VLOOKUP(I12,'Feriados y días laborables'!$E$5:$F$11,2,0)=\"Si\",NOT(ISNUMBER(VLOOKUP(DATE($A$7,$A$9+1-1,I11),Feriados,1,0)))),TRUE,FALSE),FALSE)","v":true},{"$f":"IFERROR(IF(AND(VLOOKUP(J12,'Feriados y días laborables'!$E$5:$F$11,2,0)=\"Si\",NOT(ISNUMBER(VLOOKUP(DATE($A$7,$A$9+1-1,J11),Feriados,1,0)))),TRUE,FALSE),FALSE)","v":false},{"$f":"IFERROR(IF(AND(VLOOKUP(K12,'Feriados y días laborables'!$E$5:$F$11,2,0)=\"Si\",NOT(ISNUMBER(VLOOKUP(DATE($A$7,$A$9+1-1,K11),Feriados,1,0)))),TRUE,FALSE),FALSE)","v":false},{"$f":"IFERROR(IF(AND(VLOOKUP(L12,'Feriados y días laborables'!$E$5:$F$11,2,0)=\"Si\",NOT(ISNUMBER(VLOOKUP(DATE($A$7,$A$9+1-1,L11),Feriados,1,0)))),TRUE,FALSE),FALSE)","v":true},{"$f":"IFERROR(IF(AND(VLOOKUP(M12,'Feriados y días laborables'!$E$5:$F$11,2,0)=\"Si\",NOT(ISNUMBER(VLOOKUP(DATE($A$7,$A$9+1-1,M11),Feriados,1,0)))),TRUE,FALSE),FALSE)","v":true},{"$f":"IFERROR(IF(AND(VLOOKUP(N12,'Feriados y días laborables'!$E$5:$F$11,2,0)=\"Si\",NOT(ISNUMBER(VLOOKUP(DATE($A$7,$A$9+1-1,N11),Feriados,1,0)))),TRUE,FALSE),FALSE)","v":true},{"$f":"IFERROR(IF(AND(VLOOKUP(O12,'Feriados y días laborables'!$E$5:$F$11,2,0)=\"Si\",NOT(ISNUMBER(VLOOKUP(DATE($A$7,$A$9+1-1,O11),Feriados,1,0)))),TRUE,FALSE),FALSE)","v":true},{"$f":"IFERROR(IF(AND(VLOOKUP(P12,'Feriados y días laborables'!$E$5:$F$11,2,0)=\"Si\",NOT(ISNUMBER(VLOOKUP(DATE($A$7,$A$9+1-1,P11),Feriados,1,0)))),TRUE,FALSE),FALSE)","v":true},{"$f":"IFERROR(IF(AND(VLOOKUP(Q12,'Feriados y días laborables'!$E$5:$F$11,2,0)=\"Si\",NOT(ISNUMBER(VLOOKUP(DATE($A$7,$A$9+1-1,Q11),Feriados,1,0)))),TRUE,FALSE),FALSE)","v":false},{"$f":"IFERROR(IF(AND(VLOOKUP(R12,'Feriados y días laborables'!$E$5:$F$11,2,0)=\"Si\",NOT(ISNUMBER(VLOOKUP(DATE($A$7,$A$9+1-1,R11),Feriados,1,0)))),TRUE,FALSE),FALSE)","v":false},{"$f":"IFERROR(IF(AND(VLOOKUP(S12,'Feriados y días laborables'!$E$5:$F$11,2,0)=\"Si\",NOT(ISNUMBER(VLOOKUP(DATE($A$7,$A$9+1-1,S11),Feriados,1,0)))),TRUE,FALSE),FALSE)","v":true},{"$f":"IFERROR(IF(AND(VLOOKUP(T12,'Feriados y días laborables'!$E$5:$F$11,2,0)=\"Si\",NOT(ISNUMBER(VLOOKUP(DATE($A$7,$A$9+1-1,T11),Feriados,1,0)))),TRUE,FALSE),FALSE)","v":true},{"$f":"IFERROR(IF(AND(VLOOKUP(U12,'Feriados y días laborables'!$E$5:$F$11,2,0)=\"Si\",NOT(ISNUMBER(VLOOKUP(DATE($A$7,$A$9+1-1,U11),Feriados,1,0)))),TRUE,FALSE),FALSE)","v":true},{"$f":"IFERROR(IF(AND(VLOOKUP(V12,'Feriados y días laborables'!$E$5:$F$11,2,0)=\"Si\",NOT(ISNUMBER(VLOOKUP(DATE($A$7,$A$9+1-1,V11),Feriados,1,0)))),TRUE,FALSE),FALSE)","v":true},{"$f":"IFERROR(IF(AND(VLOOKUP(W12,'Feriados y días laborables'!$E$5:$F$11,2,0)=\"Si\",NOT(ISNUMBER(VLOOKUP(DATE($A$7,$A$9+1-1,W11),Feriados,1,0)))),TRUE,FALSE),FALSE)","v":true},{"$f":"IFERROR(IF(AND(VLOOKUP(X12,'Feriados y días laborables'!$E$5:$F$11,2,0)=\"Si\",NOT(ISNUMBER(VLOOKUP(DATE($A$7,$A$9+1-1,X11),Feriados,1,0)))),TRUE,FALSE),FALSE)","v":false},{"$f":"IFERROR(IF(AND(VLOOKUP(Y12,'Feriados y días laborables'!$E$5:$F$11,2,0)=\"Si\",NOT(ISNUMBER(VLOOKUP(DATE($A$7,$A$9+1-1,Y11),Feriados,1,0)))),TRUE,FALSE),FALSE)","v":false},{"$f":"IFERROR(IF(AND(VLOOKUP(Z12,'Feriados y días laborables'!$E$5:$F$11,2,0)=\"Si\",NOT(ISNUMBER(VLOOKUP(DATE($A$7,$A$9+1-1,Z11),Feriados,1,0)))),TRUE,FALSE),FALSE)","v":true},{"$f":"IFERROR(IF(AND(VLOOKUP(AA12,'Feriados y días laborables'!$E$5:$F$11,2,0)=\"Si\",NOT(ISNUMBER(VLOOKUP(DATE($A$7,$A$9+1-1,AA11),Feriados,1,0)))),TRUE,FALSE),FALSE)","v":true},{"$f":"IFERROR(IF(AND(VLOOKUP(AB12,'Feriados y días laborables'!$E$5:$F$11,2,0)=\"Si\",NOT(ISNUMBER(VLOOKUP(DATE($A$7,$A$9+1-1,AB11),Feriados,1,0)))),TRUE,FALSE),FALSE)","v":true},{"$f":"IFERROR(IF(AND(VLOOKUP(AC12,'Feriados y días laborables'!$E$5:$F$11,2,0)=\"Si\",NOT(ISNUMBER(VLOOKUP(DATE($A$7,$A$9+1-1,AC11),Feriados,1,0)))),TRUE,FALSE),FALSE)","v":true},{"$f":"IFERROR(IF(AND(VLOOKUP(AD12,'Feriados y días laborables'!$E$5:$F$11,2,0)=\"Si\",NOT(ISNUMBER(VLOOKUP(DATE($A$7,$A$9+1-1,AD11),Feriados,1,0)))),TRUE,FALSE),FALSE)","v":true},{"$f":"IFERROR(IF(AND(VLOOKUP(AE12,'Feriados y días laborables'!$E$5:$F$11,2,0)=\"Si\",NOT(ISNUMBER(VLOOKUP(DATE($A$7,$A$9+1-1,AE11),Feriados,1,0)))),TRUE,FALSE),FALSE)","v":false},{"$f":"IFERROR(IF(AND(VLOOKUP(AF12,'Feriados y días laborables'!$E$5:$F$11,2,0)=\"Si\",NOT(ISNUMBER(VLOOKUP(DATE($A$7,$A$9+1-1,AF11),Feriados,1,0)))),TRUE,FALSE),FALSE)","v":false},{"$f":"IFERROR(IF(AND(VLOOKUP(AG12,'Feriados y días laborables'!$E$5:$F$11,2,0)=\"Si\",NOT(ISNUMBER(VLOOKUP(DATE($A$7,$A$9+1-1,AG11),Feriados,1,0)))),TRUE,FALSE),FALSE)","v":false},{"$f":"IFERROR(IF(AND(VLOOKUP(AH12,'Feriados y días laborables'!$E$5:$F$11,2,0)=\"Si\",NOT(ISNUMBER(VLOOKUP(DATE($A$7,$A$9+1-1,AH11),Feriados,1,0)))),TRUE,FALSE),FALSE)","v":false},{"$f":"IFERROR(IF(AND(VLOOKUP(AI12,'Feriados y días laborables'!$E$5:$F$11,2,0)=\"Si\",NOT(ISNUMBER(VLOOKUP(DATE($A$7,$A$9+1-1,AI11),Feriados,1,0)))),TRUE,FALSE),FALSE)","v":false},{"$f":"IFERROR(IF(AND(VLOOKUP(AJ12,'Feriados y días laborables'!$E$5:$F$11,2,0)=\"Si\",NOT(ISNUMBER(VLOOKUP(DATE($A$7,$A$9+1-1,AJ11),Feriados,1,0)))),TRUE,FALSE),FALSE)","v":false},{"$f":"IFERROR(IF(AND(VLOOKUP(AK12,'Feriados y días laborables'!$E$5:$F$11,2,0)=\"Si\",NOT(ISNUMBER(VLOOKUP(DATE($A$7,$A$9+1-1,AK11),Feriados,1,0)))),TRUE,FALSE),FALSE)","v":false},{"$f":"IFERROR(IF(AND(VLOOKUP(AL12,'Feriados y días laborables'!$E$5:$F$11,2,0)=\"Si\",NOT(ISNUMBER(VLOOKUP(DATE($A$7,$A$9+1-1,AL11),Feriados,1,0)))),TRUE,FALSE),FALSE)","v":false},{"$f":"IFERROR(IF(AND(VLOOKUP(AM12,'Feriados y días laborables'!$E$5:$F$11,2,0)=\"Si\",NOT(ISNUMBER(VLOOKUP(DATE($A$7,$A$9+1-1,AM11),Feriados,1,0)))),TRUE,FALSE),FALSE)","v":false},{"$f":"IFERROR(IF(AND(VLOOKUP(AN12,'Feriados y días laborables'!$E$5:$F$11,2,0)=\"Si\",NOT(ISNUMBER(VLOOKUP(DATE($A$7,$A$9+1-1,AN11),Feriados,1,0)))),TRUE,FALSE),FALSE)","v":false},{"$f":"IFERROR(IF(AND(VLOOKUP(AO12,'Feriados y días laborables'!$E$5:$F$11,2,0)=\"Si\",NOT(ISNUMBER(VLOOKUP(DATE($A$7,$A$9+1-1,AO11),Feriados,1,0)))),TRUE,FALSE),FALSE)","v":false},{"$f":"IFERROR(IF(AND(VLOOKUP(AP12,'Feriados y días laborables'!$E$5:$F$11,2,0)=\"Si\",NOT(ISNUMBER(VLOOKUP(DATE($A$7,$A$9+1-1,AP11),Feriados,1,0)))),TRUE,FALSE),FALSE)","v":false},{"$f":"IFERROR(IF(AND(VLOOKUP(AQ12,'Feriados y días laborables'!$E$5:$F$11,2,0)=\"Si\",NOT(ISNUMBER(VLOOKUP(DATE($A$7,$A$9+1-1,AQ11),Feriados,1,0)))),TRUE,FALSE),FALSE)","v":false},{"$f":"IFERROR(IF(AND(VLOOKUP(AR12,'Feriados y días laborables'!$E$5:$F$11,2,0)=\"Si\",NOT(ISNUMBER(VLOOKUP(DATE($A$7,$A$9+1-1,AR11),Feriados,1,0)))),TRUE,FALSE),FALSE)","v":false},{"$f":"IFERROR(IF(AND(VLOOKUP(AS12,'Feriados y días laborables'!$E$5:$F$11,2,0)=\"Si\",NOT(ISNUMBER(VLOOKUP(DATE($A$7,$A$9+1-1,AS11),Feriados,1,0)))),TRUE,FALSE),FALSE)","v":false},{"$f":"IFERROR(IF(AND(VLOOKUP(AT12,'Feriados y días laborables'!$E$5:$F$11,2,0)=\"Si\",NOT(ISNUMBER(VLOOKUP(DATE($A$7,$A$9+1-1,AT11),Feriados,1,0)))),TRUE,FALSE),FALSE)","v":false},{"$f":"IFERROR(IF(AND(VLOOKUP(AU12,'Feriados y días laborables'!$E$5:$F$11,2,0)=\"Si\",NOT(ISNUMBER(VLOOKUP(DATE($A$7,$A$9+1-1,AU11),Feriados,1,0)))),TRUE,FALSE),FALSE)","v":false},{"$f":"IFERROR(IF(AND(VLOOKUP(AV12,'Feriados y días laborables'!$E$5:$F$11,2,0)=\"Si\",NOT(ISNUMBER(VLOOKUP(DATE($A$7,$A$9+1-1,AV11),Feriados,1,0)))),TRUE,FALSE),FALSE)","v":false},{"$f":"IFERROR(IF(AND(VLOOKUP(AW12,'Feriados y días laborables'!$E$5:$F$11,2,0)=\"Si\",NOT(ISNUMBER(VLOOKUP(DATE($A$7,$A$9+1-1,AW11),Feriados,1,0)))),TRUE,FALSE),FALSE)","v":false},{"$f":"IFERROR(IF(AND(VLOOKUP(AX12,'Feriados y días laborables'!$E$5:$F$11,2,0)=\"Si\",NOT(ISNUMBER(VLOOKUP(DATE($A$7,$A$9+1-1,AX11),Feriados,1,0)))),TRUE,FALSE),FALSE)","v":false},{"$f":"IFERROR(IF(AND(VLOOKUP(AY12,'Feriados y días laborables'!$E$5:$F$11,2,0)=\"Si\",NOT(ISNUMBER(VLOOKUP(DATE($A$7,$A$9+1-1,AY11),Feriados,1,0)))),TRUE,FALSE),FALSE)","v":false},{"$f":"IFERROR(IF(AND(VLOOKUP(AZ12,'Feriados y días laborables'!$E$5:$F$11,2,0)=\"Si\",NOT(ISNUMBER(VLOOKUP(DATE($A$7,$A$9+1-1,AZ11),Feriados,1,0)))),TRUE,FALSE),FALSE)","v":false},{"$f":"IFERROR(IF(AND(VLOOKUP(BA12,'Feriados y días laborables'!$E$5:$F$11,2,0)=\"Si\",NOT(ISNUMBER(VLOOKUP(DATE($A$7,$A$9+1-1,BA11),Feriados,1,0)))),TRUE,FALSE),FALSE)","v":false},{"$f":"IFERROR(IF(AND(VLOOKUP(BB12,'Feriados y días laborables'!$E$5:$F$11,2,0)=\"Si\",NOT(ISNUMBER(VLOOKUP(DATE($A$7,$A$9+1-1,BB11),Feriados,1,0)))),TRUE,FALSE),FALSE)","v":false},{"$f":"IFERROR(IF(AND(VLOOKUP(BC12,'Feriados y días laborables'!$E$5:$F$11,2,0)=\"Si\",NOT(ISNUMBER(VLOOKUP(DATE($A$7,$A$9+1-1,BC11),Feriados,1,0)))),TRUE,FALSE),FALSE)","v":false},{"$f":"IFERROR(IF(AND(VLOOKUP(BD12,'Feriados y días laborables'!$E$5:$F$11,2,0)=\"Si\",NOT(ISNUMBER(VLOOKUP(DATE($A$7,$A$9+1-1,BD11),Feriados,1,0)))),TRUE,FALSE),FALSE)","v":false},{"$f":"IFERROR(IF(AND(VLOOKUP(BE12,'Feriados y días laborables'!$E$5:$F$11,2,0)=\"Si\",NOT(ISNUMBER(VLOOKUP(DATE($A$7,$A$9+1-1,BE11),Feriados,1,0)))),TRUE,FALSE),FALSE)","v":false},{"$f":"IFERROR(IF(AND(VLOOKUP(BF12,'Feriados y días laborables'!$E$5:$F$11,2,0)=\"Si\",NOT(ISNUMBER(VLOOKUP(DATE($A$7,$A$9+1-1,BF11),Feriados,1,0)))),TRUE,FALSE),FALSE)","v":false},{"$f":"IFERROR(IF(AND(VLOOKUP(BG12,'Feriados y días laborables'!$E$5:$F$11,2,0)=\"Si\",NOT(ISNUMBER(VLOOKUP(DATE($A$7,$A$9+1-1,BG11),Feriados,1,0)))),TRUE,FALSE),FALSE)","v":false},{"$f":"IFERROR(IF(AND(VLOOKUP(BH12,'Feriados y días laborables'!$E$5:$F$11,2,0)=\"Si\",NOT(ISNUMBER(VLOOKUP(DATE($A$7,$A$9+1-1,BH11),Feriados,1,0)))),TRUE,FALSE),FALSE)","v":false},{"$f":"IFERROR(IF(AND(VLOOKUP(BI12,'Feriados y días laborables'!$E$5:$F$11,2,0)=\"Si\",NOT(ISNUMBER(VLOOKUP(DATE($A$7,$A$9+1-1,BI11),Feriados,1,0)))),TRUE,FALSE),FALSE)","v":false},{"$f":"IFERROR(IF(AND(VLOOKUP(BJ12,'Feriados y días laborables'!$E$5:$F$11,2,0)=\"Si\",NOT(ISNUMBER(VLOOKUP(DATE($A$7,$A$9+1-1,BJ11),Feriados,1,0)))),TRUE,FALSE),FALSE)","v":false},{"$f":"IFERROR(IF(AND(VLOOKUP(BK12,'Feriados y días laborables'!$E$5:$F$11,2,0)=\"Si\",NOT(ISNUMBER(VLOOKUP(DATE($A$7,$A$9+1-1,BK11),Feriados,1,0)))),TRUE,FALSE),FALSE)","v":false},{"$f":"IFERROR(IF(AND(VLOOKUP(BL12,'Feriados y días laborables'!$E$5:$F$11,2,0)=\"Si\",NOT(ISNUMBER(VLOOKUP(DATE($A$7,$A$9+1-1,BL11),Feriados,1,0)))),TRUE,FALSE),FALSE)","v":false},{"$f":"IFERROR(IF(AND(VLOOKUP(BM12,'Feriados y días laborables'!$E$5:$F$11,2,0)=\"Si\",NOT(ISNUMBER(VLOOKUP(DATE($A$7,$A$9+1-1,BM11),Feriados,1,0)))),TRUE,FALSE),FALSE)","v":false},{"$f":"IFERROR(IF(AND(VLOOKUP(BN12,'Feriados y días laborables'!$E$5:$F$11,2,0)=\"Si\",NOT(ISNUMBER(VLOOKUP(DATE($A$7,$A$9+1-1,BN11),Feriados,1,0)))),TRUE,FALSE),FALSE)","v":false},{"$f":"IFERROR(IF(AND(VLOOKUP(BO12,'Feriados y días laborables'!$E$5:$F$11,2,0)=\"Si\",NOT(ISNUMBER(VLOOKUP(DATE($A$7,$A$9+1-1,BO11),Feriados,1,0)))),TRUE,FALSE),FALSE)","v":false},{"$f":"IFERROR(IF(AND(VLOOKUP(BP12,'Feriados y días laborables'!$E$5:$F$11,2,0)=\"Si\",NOT(ISNUMBER(VLOOKUP(DATE($A$7,$A$9+1-1,BP11),Feriados,1,0)))),TRUE,FALSE),FALSE)","v":false},{"$f":"IFERROR(IF(AND(VLOOKUP(BQ12,'Feriados y días laborables'!$E$5:$F$11,2,0)=\"Si\",NOT(ISNUMBER(VLOOKUP(DATE($A$7,$A$9+1-1,BQ11),Feriados,1,0)))),TRUE,FALSE),FALSE)","v":false},{"$f":"IFERROR(IF(AND(VLOOKUP(BR12,'Feriados y días laborables'!$E$5:$F$11,2,0)=\"Si\",NOT(ISNUMBER(VLOOKUP(DATE($A$7,$A$9+1-1,BR11),Feriados,1,0)))),TRUE,FALSE),FALSE)","v":false},{"$f":"IFERROR(IF(AND(VLOOKUP(BS12,'Feriados y días laborables'!$E$5:$F$11,2,0)=\"Si\",NOT(ISNUMBER(VLOOKUP(DATE($A$7,$A$9+1-1,BS11),Feriados,1,0)))),TRUE,FALSE),FALSE)","v":false},{"$f":"IFERROR(IF(AND(VLOOKUP(BT12,'Feriados y días laborables'!$E$5:$F$11,2,0)=\"Si\",NOT(ISNUMBER(VLOOKUP(DATE($A$7,$A$9+1-1,BT11),Feriados,1,0)))),TRUE,FALSE),FALSE)","v":false},{"$f":"IFERROR(IF(AND(VLOOKUP(BU12,'Feriados y días laborables'!$E$5:$F$11,2,0)=\"Si\",NOT(ISNUMBER(VLOOKUP(DATE($A$7,$A$9+1-1,BU11),Feriados,1,0)))),TRUE,FALSE),FALSE)","v":false},{"$f":"IFERROR(IF(AND(VLOOKUP(BV12,'Feriados y días laborables'!$E$5:$F$11,2,0)=\"Si\",NOT(ISNUMBER(VLOOKUP(DATE($A$7,$A$9+1-1,BV11),Feriados,1,0)))),TRUE,FALSE),FALSE)","v":false},{"$f":"IFERROR(IF(AND(VLOOKUP(BW12,'Feriados y días laborables'!$E$5:$F$11,2,0)=\"Si\",NOT(ISNUMBER(VLOOKUP(DATE($A$7,$A$9+1-1,BW11),Feriados,1,0)))),TRUE,FALSE),FALSE)","v":false},{"$f":"IFERROR(IF(AND(VLOOKUP(BX12,'Feriados y días laborables'!$E$5:$F$11,2,0)=\"Si\",NOT(ISNUMBER(VLOOKUP(DATE($A$7,$A$9+1-1,BX11),Feriados,1,0)))),TRUE,FALSE),FALSE)","v":false},{"$f":"IFERROR(IF(AND(VLOOKUP(BY12,'Feriados y días laborables'!$E$5:$F$11,2,0)=\"Si\",NOT(ISNUMBER(VLOOKUP(DATE($A$7,$A$9+1-1,BY11),Feriados,1,0)))),TRUE,FALSE),FALSE)","v":false},{"$f":"IFERROR(IF(AND(VLOOKUP(BZ12,'Feriados y días laborables'!$E$5:$F$11,2,0)=\"Si\",NOT(ISNUMBER(VLOOKUP(DATE($A$7,$A$9+1-1,BZ11),Feriados,1,0)))),TRUE,FALSE),FALSE)","v":false},{"$f":"IFERROR(IF(AND(VLOOKUP(CA12,'Feriados y días laborables'!$E$5:$F$11,2,0)=\"Si\",NOT(ISNUMBER(VLOOKUP(DATE($A$7,$A$9+1-1,CA11),Feriados,1,0)))),TRUE,FALSE),FALSE)","v":false},{"$f":"IFERROR(IF(AND(VLOOKUP(CB12,'Feriados y días laborables'!$E$5:$F$11,2,0)=\"Si\",NOT(ISNUMBER(VLOOKUP(DATE($A$7,$A$9+1-1,CB11),Feriados,1,0)))),TRUE,FALSE),FALSE)","v":false},{"$f":"IFERROR(IF(AND(VLOOKUP(CC12,'Feriados y días laborables'!$E$5:$F$11,2,0)=\"Si\",NOT(ISNUMBER(VLOOKUP(DATE($A$7,$A$9+1-1,CC11),Feriados,1,0)))),TRUE,FALSE),FALSE)","v":false},{"$f":"IFERROR(IF(AND(VLOOKUP(CD12,'Feriados y días laborables'!$E$5:$F$11,2,0)=\"Si\",NOT(ISNUMBER(VLOOKUP(DATE($A$7,$A$9+1-1,CD11),Feriados,1,0)))),TRUE,FALSE),FALSE)","v":false},{"$f":"IFERROR(IF(AND(VLOOKUP(CE12,'Feriados y días laborables'!$E$5:$F$11,2,0)=\"Si\",NOT(ISNUMBER(VLOOKUP(DATE($A$7,$A$9+1-1,CE11),Feriados,1,0)))),TRUE,FALSE),FALSE)","v":false},{"$f":"IFERROR(IF(AND(VLOOKUP(CF12,'Feriados y días laborables'!$E$5:$F$11,2,0)=\"Si\",NOT(ISNUMBER(VLOOKUP(DATE($A$7,$A$9+1-1,CF11),Feriados,1,0)))),TRUE,FALSE),FALSE)","v":false},{"$f":"IFERROR(IF(AND(VLOOKUP(CG12,'Feriados y días laborables'!$E$5:$F$11,2,0)=\"Si\",NOT(ISNUMBER(VLOOKUP(DATE($A$7,$A$9+1-1,CG11),Feriados,1,0)))),TRUE,FALSE),FALSE)","v":false},{"$f":"IFERROR(IF(AND(VLOOKUP(CH12,'Feriados y días laborables'!$E$5:$F$11,2,0)=\"Si\",NOT(ISNUMBER(VLOOKUP(DATE($A$7,$A$9+1-1,CH11),Feriados,1,0)))),TRUE,FALSE),FALSE)","v":false},{"$f":"IFERROR(IF(AND(VLOOKUP(CI12,'Feriados y días laborables'!$E$5:$F$11,2,0)=\"Si\",NOT(ISNUMBER(VLOOKUP(DATE($A$7,$A$9+1-1,CI11),Feriados,1,0)))),TRUE,FALSE),FALSE)","v":false},{"$f":"IFERROR(IF(AND(VLOOKUP(CJ12,'Feriados y días laborables'!$E$5:$F$11,2,0)=\"Si\",NOT(ISNUMBER(VLOOKUP(DATE($A$7,$A$9+1-1,CJ11),Feriados,1,0)))),TRUE,FALSE),FALSE)","v":false},{"$f":"IFERROR(IF(AND(VLOOKUP(CK12,'Feriados y días laborables'!$E$5:$F$11,2,0)=\"Si\",NOT(ISNUMBER(VLOOKUP(DATE($A$7,$A$9+1-1,CK11),Feriados,1,0)))),TRUE,FALSE),FALSE)","v":false},{"$f":"IFERROR(IF(AND(VLOOKUP(CL12,'Feriados y días laborables'!$E$5:$F$11,2,0)=\"Si\",NOT(ISNUMBER(VLOOKUP(DATE($A$7,$A$9+1-1,CL11),Feriados,1,0)))),TRUE,FALSE),FALSE)","v":false},{"$f":"IFERROR(IF(AND(VLOOKUP(CM12,'Feriados y días laborables'!$E$5:$F$11,2,0)=\"Si\",NOT(ISNUMBER(VLOOKUP(DATE($A$7,$A$9+1-1,CM11),Feriados,1,0)))),TRUE,FALSE),FALSE)","v":false},{"$f":"IFERROR(IF(AND(VLOOKUP(CN12,'Feriados y días laborables'!$E$5:$F$11,2,0)=\"Si\",NOT(ISNUMBER(VLOOKUP(DATE($A$7,$A$9+1-1,CN11),Feriados,1,0)))),TRUE,FALSE),FALSE)","v":false},{"$f":"IFERROR(IF(AND(VLOOKUP(CO12,'Feriados y días laborables'!$E$5:$F$11,2,0)=\"Si\",NOT(ISNUMBER(VLOOKUP(DATE($A$7,$A$9+1-1,CO11),Feriados,1,0)))),TRUE,FALSE),FALSE)","v":false},{"$f":"IFERROR(IF(AND(VLOOKUP(CP12,'Feriados y días laborables'!$E$5:$F$11,2,0)=\"Si\",NOT(ISNUMBER(VLOOKUP(DATE($A$7,$A$9+1-1,CP11),Feriados,1,0)))),TRUE,FALSE),FALSE)","v":false},{"$f":"IFERROR(IF(AND(VLOOKUP(CQ12,'Feriados y días laborables'!$E$5:$F$11,2,0)=\"Si\",NOT(ISNUMBER(VLOOKUP(DATE($A$7,$A$9+1-1,CQ11),Feriados,1,0)))),TRUE,FALSE),FALSE)","v":false},{"$f":"IFERROR(IF(AND(VLOOKUP(CR12,'Feriados y días laborables'!$E$5:$F$11,2,0)=\"Si\",NOT(ISNUMBER(VLOOKUP(DATE($A$7,$A$9+1-1,CR11),Feriados,1,0)))),TRUE,FALSE),FALSE)","v":false},{"$f":"IFERROR(IF(AND(VLOOKUP(CS12,'Feriados y días laborables'!$E$5:$F$11,2,0)=\"Si\",NOT(ISNUMBER(VLOOKUP(DATE($A$7,$A$9+1-1,CS11),Feriados,1,0)))),TRUE,FALSE),FALSE)","v":false},{"$f":"IFERROR(IF(AND(VLOOKUP(CT12,'Feriados y días laborables'!$E$5:$F$11,2,0)=\"Si\",NOT(ISNUMBER(VLOOKUP(DATE($A$7,$A$9+1-1,CT11),Feriados,1,0)))),TRUE,FALSE),FALSE)","v":false},{"$f":"IFERROR(IF(AND(VLOOKUP(CU12,'Feriados y días laborables'!$E$5:$F$11,2,0)=\"Si\",NOT(ISNUMBER(VLOOKUP(DATE($A$7,$A$9+1-1,CU11),Feriados,1,0)))),TRUE,FALSE),FALSE)","v":false},{"$f":"IFERROR(IF(AND(VLOOKUP(CV12,'Feriados y días laborables'!$E$5:$F$11,2,0)=\"Si\",NOT(ISNUMBER(VLOOKUP(DATE($A$7,$A$9+1-1,CV11),Feriados,1,0)))),TRUE,FALSE),FALSE)","v":false},{"$f":"IFERROR(IF(AND(VLOOKUP(CW12,'Feriados y días laborables'!$E$5:$F$11,2,0)=\"Si\",NOT(ISNUMBER(VLOOKUP(DATE($A$7,$A$9+1-1,CW11),Feriados,1,0)))),TRUE,FALSE),FALSE)","v":false},{"$f":"IFERROR(IF(AND(VLOOKUP(CX12,'Feriados y días laborables'!$E$5:$F$11,2,0)=\"Si\",NOT(ISNUMBER(VLOOKUP(DATE($A$7,$A$9+1-1,CX11),Feriados,1,0)))),TRUE,FALSE),FALSE)","v":false},{"$f":"IFERROR(IF(AND(VLOOKUP(CY12,'Feriados y días laborables'!$E$5:$F$11,2,0)=\"Si\",NOT(ISNUMBER(VLOOKUP(DATE($A$7,$A$9+1-1,CY11),Feriados,1,0)))),TRUE,FALSE),FALSE)","v":false},{"$f":"IFERROR(IF(AND(VLOOKUP(CZ12,'Feriados y días laborables'!$E$5:$F$11,2,0)=\"Si\",NOT(ISNUMBER(VLOOKUP(DATE($A$7,$A$9+1-1,CZ11),Feriados,1,0)))),TRUE,FALSE),FALSE)","v":false},{"$f":"IFERROR(IF(AND(VLOOKUP(DA12,'Feriados y días laborables'!$E$5:$F$11,2,0)=\"Si\",NOT(ISNUMBER(VLOOKUP(DATE($A$7,$A$9+1-1,DA11),Feriados,1,0)))),TRUE,FALSE),FALSE)","v":false},{"$f":"IFERROR(IF(AND(VLOOKUP(DB12,'Feriados y días laborables'!$E$5:$F$11,2,0)=\"Si\",NOT(ISNUMBER(VLOOKUP(DATE($A$7,$A$9+1-1,DB11),Feriados,1,0)))),TRUE,FALSE),FALSE)","v":false},{"$f":"IFERROR(IF(AND(VLOOKUP(DC12,'Feriados y días laborables'!$E$5:$F$11,2,0)=\"Si\",NOT(ISNUMBER(VLOOKUP(DATE($A$7,$A$9+1-1,DC11),Feriados,1,0)))),TRUE,FALSE),FALSE)","v":false},{"$f":"IFERROR(IF(AND(VLOOKUP(DD12,'Feriados y días laborables'!$E$5:$F$11,2,0)=\"Si\",NOT(ISNUMBER(VLOOKUP(DATE($A$7,$A$9+1-1,DD11),Feriados,1,0)))),TRUE,FALSE),FALSE)","v":false},{"$f":"IFERROR(IF(AND(VLOOKUP(DE12,'Feriados y días laborables'!$E$5:$F$11,2,0)=\"Si\",NOT(ISNUMBER(VLOOKUP(DATE($A$7,$A$9+1-1,DE11),Feriados,1,0)))),TRUE,FALSE),FALSE)","v":false},{"$f":"IFERROR(IF(AND(VLOOKUP(DF12,'Feriados y días laborables'!$E$5:$F$11,2,0)=\"Si\",NOT(ISNUMBER(VLOOKUP(DATE($A$7,$A$9+1-1,DF11),Feriados,1,0)))),TRUE,FALSE),FALSE)","v":false},{"$f":"IFERROR(IF(AND(VLOOKUP(DG12,'Feriados y días laborables'!$E$5:$F$11,2,0)=\"Si\",NOT(ISNUMBER(VLOOKUP(DATE($A$7,$A$9+1-1,DG11),Feriados,1,0)))),TRUE,FALSE),FALSE)","v":false},{"$f":"IFERROR(IF(AND(VLOOKUP(DH12,'Feriados y días laborables'!$E$5:$F$11,2,0)=\"Si\",NOT(ISNUMBER(VLOOKUP(DATE($A$7,$A$9+1-1,DH11),Feriados,1,0)))),TRUE,FALSE),FALSE)","v":false},{"$f":"IFERROR(IF(AND(VLOOKUP(DI12,'Feriados y días laborables'!$E$5:$F$11,2,0)=\"Si\",NOT(ISNUMBER(VLOOKUP(DATE($A$7,$A$9+1-1,DI11),Feriados,1,0)))),TRUE,FALSE),FALSE)","v":false},{"$f":"IFERROR(IF(AND(VLOOKUP(DJ12,'Feriados y días laborables'!$E$5:$F$11,2,0)=\"Si\",NOT(ISNUMBER(VLOOKUP(DATE($A$7,$A$9+1-1,DJ11),Feriados,1,0)))),TRUE,FALSE),FALSE)","v":false},{"$f":"IFERROR(IF(AND(VLOOKUP(DK12,'Feriados y días laborables'!$E$5:$F$11,2,0)=\"Si\",NOT(ISNUMBER(VLOOKUP(DATE($A$7,$A$9+1-1,DK11),Feriados,1,0)))),TRUE,FALSE),FALSE)","v":false},{"$f":"IFERROR(IF(AND(VLOOKUP(DL12,'Feriados y días laborables'!$E$5:$F$11,2,0)=\"Si\",NOT(ISNUMBER(VLOOKUP(DATE($A$7,$A$9+1-1,DL11),Feriados,1,0)))),TRUE,FALSE),FALSE)","v":false},{"$f":"IFERROR(IF(AND(VLOOKUP(DM12,'Feriados y días laborables'!$E$5:$F$11,2,0)=\"Si\",NOT(ISNUMBER(VLOOKUP(DATE($A$7,$A$9+1-1,DM11),Feriados,1,0)))),TRUE,FALSE),FALSE)","v":false},{"$f":"IFERROR(IF(AND(VLOOKUP(DN12,'Feriados y días laborables'!$E$5:$F$11,2,0)=\"Si\",NOT(ISNUMBER(VLOOKUP(DATE($A$7,$A$9+1-1,DN11),Feriados,1,0)))),TRUE,FALSE),FALSE)","v":false},{"$f":"IFERROR(IF(AND(VLOOKUP(DO12,'Feriados y días laborables'!$E$5:$F$11,2,0)=\"Si\",NOT(ISNUMBER(VLOOKUP(DATE($A$7,$A$9+1-1,DO11),Feriados,1,0)))),TRUE,FALSE),FALSE)","v":false},{"$f":"IFERROR(IF(AND(VLOOKUP(DP12,'Feriados y días laborables'!$E$5:$F$11,2,0)=\"Si\",NOT(ISNUMBER(VLOOKUP(DATE($A$7,$A$9+1-1,DP11),Feriados,1,0)))),TRUE,FALSE),FALSE)","v":false},{"$f":"IFERROR(IF(AND(VLOOKUP(DQ12,'Feriados y días laborables'!$E$5:$F$11,2,0)=\"Si\",NOT(ISNUMBER(VLOOKUP(DATE($A$7,$A$9+1-1,DQ11),Feriados,1,0)))),TRUE,FALSE),FALSE)","v":false},{"$f":"IFERROR(IF(AND(VLOOKUP(DR12,'Feriados y días laborables'!$E$5:$F$11,2,0)=\"Si\",NOT(ISNUMBER(VLOOKUP(DATE($A$7,$A$9+1-1,DR11),Feriados,1,0)))),TRUE,FALSE),FALSE)","v":false},{"$f":"IFERROR(IF(AND(VLOOKUP(DS12,'Feriados y días laborables'!$E$5:$F$11,2,0)=\"Si\",NOT(ISNUMBER(VLOOKUP(DATE($A$7,$A$9+1-1,DS11),Feriados,1,0)))),TRUE,FALSE),FALSE)","v":false},{"$f":"IFERROR(IF(AND(VLOOKUP(DT12,'Feriados y días laborables'!$E$5:$F$11,2,0)=\"Si\",NOT(ISNUMBER(VLOOKUP(DATE($A$7,$A$9+1-1,DT11),Feriados,1,0)))),TRUE,FALSE),FALSE)","v":false},{"$f":"IFERROR(IF(AND(VLOOKUP(DU12,'Feriados y días laborables'!$E$5:$F$11,2,0)=\"Si\",NOT(ISNUMBER(VLOOKUP(DATE($A$7,$A$9+1-1,DU11),Feriados,1,0)))),TRUE,FALSE),FALSE)","v":false},{"$f":"IFERROR(IF(AND(VLOOKUP(DV12,'Feriados y días laborables'!$E$5:$F$11,2,0)=\"Si\",NOT(ISNUMBER(VLOOKUP(DATE($A$7,$A$9+1-1,DV11),Feriados,1,0)))),TRUE,FALSE),FALSE)","v":false},{"$f":"IFERROR(IF(AND(VLOOKUP(DW12,'Feriados y días laborables'!$E$5:$F$11,2,0)=\"Si\",NOT(ISNUMBER(VLOOKUP(DATE($A$7,$A$9+1-1,DW11),Feriados,1,0)))),TRUE,FALSE),FALSE)","v":false},{"$f":"IFERROR(IF(AND(VLOOKUP(DX12,'Feriados y días laborables'!$E$5:$F$11,2,0)=\"Si\",NOT(ISNUMBER(VLOOKUP(DATE($A$7,$A$9+1-1,DX11),Feriados,1,0)))),TRUE,FALSE),FALSE)","v":false},{"$f":"IFERROR(IF(AND(VLOOKUP(DY12,'Feriados y días laborables'!$E$5:$F$11,2,0)=\"Si\",NOT(ISNUMBER(VLOOKUP(DATE($A$7,$A$9+1-1,DY11),Feriados,1,0)))),TRUE,FALSE),FALSE)","v":false},{"$f":"IFERROR(IF(AND(VLOOKUP(DZ12,'Feriados y días laborables'!$E$5:$F$11,2,0)=\"Si\",NOT(ISNUMBER(VLOOKUP(DATE($A$7,$A$9+1-1,DZ11),Feriados,1,0)))),TRUE,FALSE),FALSE)","v":false},{"$f":"IFERROR(IF(AND(VLOOKUP(EA12,'Feriados y días laborables'!$E$5:$F$11,2,0)=\"Si\",NOT(ISNUMBER(VLOOKUP(DATE($A$7,$A$9+1-1,EA11),Feriados,1,0)))),TRUE,FALSE),FALSE)","v":false},{"$f":"IFERROR(IF(AND(VLOOKUP(EB12,'Feriados y días laborables'!$E$5:$F$11,2,0)=\"Si\",NOT(ISNUMBER(VLOOKUP(DATE($A$7,$A$9+1-1,EB11),Feriados,1,0)))),TRUE,FALSE),FALSE)","v":false},{"$f":"IFERROR(IF(AND(VLOOKUP(EC12,'Feriados y días laborables'!$E$5:$F$11,2,0)=\"Si\",NOT(ISNUMBER(VLOOKUP(DATE($A$7,$A$9+1-1,EC11),Feriados,1,0)))),TRUE,FALSE),FALSE)","v":false},{"$f":"IFERROR(IF(AND(VLOOKUP(ED12,'Feriados y días laborables'!$E$5:$F$11,2,0)=\"Si\",NOT(ISNUMBER(VLOOKUP(DATE($A$7,$A$9+1-1,ED11),Feriados,1,0)))),TRUE,FALSE),FALSE)","v":false},{"$f":"IFERROR(IF(AND(VLOOKUP(EE12,'Feriados y días laborables'!$E$5:$F$11,2,0)=\"Si\",NOT(ISNUMBER(VLOOKUP(DATE($A$7,$A$9+1-1,EE11),Feriados,1,0)))),TRUE,FALSE),FALSE)","v":false},{"$f":"IFERROR(IF(AND(VLOOKUP(EF12,'Feriados y días laborables'!$E$5:$F$11,2,0)=\"Si\",NOT(ISNUMBER(VLOOKUP(DATE($A$7,$A$9+1-1,EF11),Feriados,1,0)))),TRUE,FALSE),FALSE)","v":false},{"$f":"IFERROR(IF(AND(VLOOKUP(EG12,'Feriados y días laborables'!$E$5:$F$11,2,0)=\"Si\",NOT(ISNUMBER(VLOOKUP(DATE($A$7,$A$9+1-1,EG11),Feriados,1,0)))),TRUE,FALSE),FALSE)","v":false},{"$f":"IFERROR(IF(AND(VLOOKUP(EH12,'Feriados y días laborables'!$E$5:$F$11,2,0)=\"Si\",NOT(ISNUMBER(VLOOKUP(DATE($A$7,$A$9+1-1,EH11),Feriados,1,0)))),TRUE,FALSE),FALSE)","v":false},{"$f":"IFERROR(IF(AND(VLOOKUP(EI12,'Feriados y días laborables'!$E$5:$F$11,2,0)=\"Si\",NOT(ISNUMBER(VLOOKUP(DATE($A$7,$A$9+1-1,EI11),Feriados,1,0)))),TRUE,FALSE),FALSE)","v":false},{"$f":"IFERROR(IF(AND(VLOOKUP(EJ12,'Feriados y días laborables'!$E$5:$F$11,2,0)=\"Si\",NOT(ISNUMBER(VLOOKUP(DATE($A$7,$A$9+1-1,EJ11),Feriados,1,0)))),TRUE,FALSE),FALSE)","v":false},{"$f":"IFERROR(IF(AND(VLOOKUP(EK12,'Feriados y días laborables'!$E$5:$F$11,2,0)=\"Si\",NOT(ISNUMBER(VLOOKUP(DATE($A$7,$A$9+1-1,EK11),Feriados,1,0)))),TRUE,FALSE),FALSE)","v":false},{"$f":"IFERROR(IF(AND(VLOOKUP(EL12,'Feriados y días laborables'!$E$5:$F$11,2,0)=\"Si\",NOT(ISNUMBER(VLOOKUP(DATE($A$7,$A$9+1-1,EL11),Feriados,1,0)))),TRUE,FALSE),FALSE)","v":false},{"$f":"IFERROR(IF(AND(VLOOKUP(EM12,'Feriados y días laborables'!$E$5:$F$11,2,0)=\"Si\",NOT(ISNUMBER(VLOOKUP(DATE($A$7,$A$9+1-1,EM11),Feriados,1,0)))),TRUE,FALSE),FALSE)","v":false},{"$f":"IFERROR(IF(AND(VLOOKUP(EN12,'Feriados y días laborables'!$E$5:$F$11,2,0)=\"Si\",NOT(ISNUMBER(VLOOKUP(DATE($A$7,$A$9+1-1,EN11),Feriados,1,0)))),TRUE,FALSE),FALSE)","v":false},{"$f":"IFERROR(IF(AND(VLOOKUP(EO12,'Feriados y días laborables'!$E$5:$F$11,2,0)=\"Si\",NOT(ISNUMBER(VLOOKUP(DATE($A$7,$A$9+1-1,EO11),Feriados,1,0)))),TRUE,FALSE),FALSE)","v":false},{"$f":"IFERROR(IF(AND(VLOOKUP(EP12,'Feriados y días laborables'!$E$5:$F$11,2,0)=\"Si\",NOT(ISNUMBER(VLOOKUP(DATE($A$7,$A$9+1-1,EP11),Feriados,1,0)))),TRUE,FALSE),FALSE)","v":false},{"$f":"IFERROR(IF(AND(VLOOKUP(EQ12,'Feriados y días laborables'!$E$5:$F$11,2,0)=\"Si\",NOT(ISNUMBER(VLOOKUP(DATE($A$7,$A$9+1-1,EQ11),Feriados,1,0)))),TRUE,FALSE),FALSE)","v":false},{"$f":"IFERROR(IF(AND(VLOOKUP(ER12,'Feriados y días laborables'!$E$5:$F$11,2,0)=\"Si\",NOT(ISNUMBER(VLOOKUP(DATE($A$7,$A$9+1-1,ER11),Feriados,1,0)))),TRUE,FALSE),FALSE)","v":false},{"$f":"IFERROR(IF(AND(VLOOKUP(ES12,'Feriados y días laborables'!$E$5:$F$11,2,0)=\"Si\",NOT(ISNUMBER(VLOOKUP(DATE($A$7,$A$9+1-1,ES11),Feriados,1,0)))),TRUE,FALSE),FALSE)","v":false},{"$f":"IFERROR(IF(AND(VLOOKUP(ET12,'Feriados y días laborables'!$E$5:$F$11,2,0)=\"Si\",NOT(ISNUMBER(VLOOKUP(DATE($A$7,$A$9+1-1,ET11),Feriados,1,0)))),TRUE,FALSE),FALSE)","v":false},{"$f":"IFERROR(IF(AND(VLOOKUP(EU12,'Feriados y días laborables'!$E$5:$F$11,2,0)=\"Si\",NOT(ISNUMBER(VLOOKUP(DATE($A$7,$A$9+1-1,EU11),Feriados,1,0)))),TRUE,FALSE),FALSE)","v":false},{"$f":"IFERROR(IF(AND(VLOOKUP(EV12,'Feriados y días laborables'!$E$5:$F$11,2,0)=\"Si\",NOT(ISNUMBER(VLOOKUP(DATE($A$7,$A$9+1-1,EV11),Feriados,1,0)))),TRUE,FALSE),FALSE)","v":false},{"$f":"IFERROR(IF(AND(VLOOKUP(EW12,'Feriados y días laborables'!$E$5:$F$11,2,0)=\"Si\",NOT(ISNUMBER(VLOOKUP(DATE($A$7,$A$9+1-1,EW11),Feriados,1,0)))),TRUE,FALSE),FALSE)","v":false},{"$f":"IFERROR(IF(AND(VLOOKUP(EX12,'Feriados y días laborables'!$E$5:$F$11,2,0)=\"Si\",NOT(ISNUMBER(VLOOKUP(DATE($A$7,$A$9+1-1,EX11),Feriados,1,0)))),TRUE,FALSE),FALSE)","v":false},{"$f":"IFERROR(IF(AND(VLOOKUP(EY12,'Feriados y días laborables'!$E$5:$F$11,2,0)=\"Si\",NOT(ISNUMBER(VLOOKUP(DATE($A$7,$A$9+1-1,EY11),Feriados,1,0)))),TRUE,FALSE),FALSE)","v":false},{"$f":"IFERROR(IF(AND(VLOOKUP(EZ12,'Feriados y días laborables'!$E$5:$F$11,2,0)=\"Si\",NOT(ISNUMBER(VLOOKUP(DATE($A$7,$A$9+1-1,EZ11),Feriados,1,0)))),TRUE,FALSE),FALSE)","v":false},{"$f":"IFERROR(IF(AND(VLOOKUP(FA12,'Feriados y días laborables'!$E$5:$F$11,2,0)=\"Si\",NOT(ISNUMBER(VLOOKUP(DATE($A$7,$A$9+1-1,FA11),Feriados,1,0)))),TRUE,FALSE),FALSE)","v":false},{"$f":"IFERROR(IF(AND(VLOOKUP(FB12,'Feriados y días laborables'!$E$5:$F$11,2,0)=\"Si\",NOT(ISNUMBER(VLOOKUP(DATE($A$7,$A$9+1-1,FB11),Feriados,1,0)))),TRUE,FALSE),FALSE)","v":false},{"$f":"IFERROR(IF(AND(VLOOKUP(FC12,'Feriados y días laborables'!$E$5:$F$11,2,0)=\"Si\",NOT(ISNUMBER(VLOOKUP(DATE($A$7,$A$9+1-1,FC11),Feriados,1,0)))),TRUE,FALSE),FALSE)","v":false},{"$f":"IFERROR(IF(AND(VLOOKUP(FD12,'Feriados y días laborables'!$E$5:$F$11,2,0)=\"Si\",NOT(ISNUMBER(VLOOKUP(DATE($A$7,$A$9+1-1,FD11),Feriados,1,0)))),TRUE,FALSE),FALSE)","v":false},{"$f":"IFERROR(IF(AND(VLOOKUP(FE12,'Feriados y días laborables'!$E$5:$F$11,2,0)=\"Si\",NOT(ISNUMBER(VLOOKUP(DATE($A$7,$A$9+1-1,FE11),Feriados,1,0)))),TRUE,FALSE),FALSE)","v":false},{"$f":"IFERROR(IF(AND(VLOOKUP(FF12,'Feriados y días laborables'!$E$5:$F$11,2,0)=\"Si\",NOT(ISNUMBER(VLOOKUP(DATE($A$7,$A$9+1-1,FF11),Feriados,1,0)))),TRUE,FALSE),FALSE)","v":false},{"$f":"IFERROR(IF(AND(VLOOKUP(FG12,'Feriados y días laborables'!$E$5:$F$11,2,0)=\"Si\",NOT(ISNUMBER(VLOOKUP(DATE($A$7,$A$9+1-1,FG11),Feriados,1,0)))),TRUE,FALSE),FALSE)","v":false},{"$f":"IFERROR(IF(AND(VLOOKUP(FH12,'Feriados y días laborables'!$E$5:$F$11,2,0)=\"Si\",NOT(ISNUMBER(VLOOKUP(DATE($A$7,$A$9+1-1,FH11),Feriados,1,0)))),TRUE,FALSE),FALSE)","v":false},{"$f":"IFERROR(IF(AND(VLOOKUP(FI12,'Feriados y días laborables'!$E$5:$F$11,2,0)=\"Si\",NOT(ISNUMBER(VLOOKUP(DATE($A$7,$A$9+1-1,FI11),Feriados,1,0)))),TRUE,FALSE),FALSE)","v":false},{"$f":"IFERROR(IF(AND(VLOOKUP(FJ12,'Feriados y días laborables'!$E$5:$F$11,2,0)=\"Si\",NOT(ISNUMBER(VLOOKUP(DATE($A$7,$A$9+1-1,FJ11),Feriados,1,0)))),TRUE,FALSE),FALSE)","v":false},{"$f":"IFERROR(IF(AND(VLOOKUP(FK12,'Feriados y días laborables'!$E$5:$F$11,2,0)=\"Si\",NOT(ISNUMBER(VLOOKUP(DATE($A$7,$A$9+1-1,FK11),Feriados,1,0)))),TRUE,FALSE),FALSE)","v":false},{"$f":"IFERROR(IF(AND(VLOOKUP(FL12,'Feriados y días laborables'!$E$5:$F$11,2,0)=\"Si\",NOT(ISNUMBER(VLOOKUP(DATE($A$7,$A$9+1-1,FL11),Feriados,1,0)))),TRUE,FALSE),FALSE)","v":false},{"$f":"IFERROR(IF(AND(VLOOKUP(FM12,'Feriados y días laborables'!$E$5:$F$11,2,0)=\"Si\",NOT(ISNUMBER(VLOOKUP(DATE($A$7,$A$9+1-1,FM11),Feriados,1,0)))),TRUE,FALSE),FALSE)","v":false},{"$f":"IFERROR(IF(AND(VLOOKUP(FN12,'Feriados y días laborables'!$E$5:$F$11,2,0)=\"Si\",NOT(ISNUMBER(VLOOKUP(DATE($A$7,$A$9+1-1,FN11),Feriados,1,0)))),TRUE,FALSE),FALSE)","v":false},{"$f":"IFERROR(IF(AND(VLOOKUP(FO12,'Feriados y días laborables'!$E$5:$F$11,2,0)=\"Si\",NOT(ISNUMBER(VLOOKUP(DATE($A$7,$A$9+1-1,FO11),Feriados,1,0)))),TRUE,FALSE),FALSE)","v":false},{"$f":"IFERROR(IF(AND(VLOOKUP(FP12,'Feriados y días laborables'!$E$5:$F$11,2,0)=\"Si\",NOT(ISNUMBER(VLOOKUP(DATE($A$7,$A$9+1-1,FP11),Feriados,1,0)))),TRUE,FALSE),FALSE)","v":false},{"$f":"IFERROR(IF(AND(VLOOKUP(FQ12,'Feriados y días laborables'!$E$5:$F$11,2,0)=\"Si\",NOT(ISNUMBER(VLOOKUP(DATE($A$7,$A$9+1-1,FQ11),Feriados,1,0)))),TRUE,FALSE),FALSE)","v":false},{"$f":"IFERROR(IF(AND(VLOOKUP(FR12,'Feriados y días laborables'!$E$5:$F$11,2,0)=\"Si\",NOT(ISNUMBER(VLOOKUP(DATE($A$7,$A$9+1-1,FR11),Feriados,1,0)))),TRUE,FALSE),FALSE)","v":false},{"$f":"IFERROR(IF(AND(VLOOKUP(FS12,'Feriados y días laborables'!$E$5:$F$11,2,0)=\"Si\",NOT(ISNUMBER(VLOOKUP(DATE($A$7,$A$9+1-1,FS11),Feriados,1,0)))),TRUE,FALSE),FALSE)","v":false},{"$f":"IFERROR(IF(AND(VLOOKUP(FT12,'Feriados y días laborables'!$E$5:$F$11,2,0)=\"Si\",NOT(ISNUMBER(VLOOKUP(DATE($A$7,$A$9+1-1,FT11),Feriados,1,0)))),TRUE,FALSE),FALSE)","v":false},{"$f":"IFERROR(IF(AND(VLOOKUP(FU12,'Feriados y días laborables'!$E$5:$F$11,2,0)=\"Si\",NOT(ISNUMBER(VLOOKUP(DATE($A$7,$A$9+1-1,FU11),Feriados,1,0)))),TRUE,FALSE),FALSE)","v":false},{"$f":"IFERROR(IF(AND(VLOOKUP(FV12,'Feriados y días laborables'!$E$5:$F$11,2,0)=\"Si\",NOT(ISNUMBER(VLOOKUP(DATE($A$7,$A$9+1-1,FV11),Feriados,1,0)))),TRUE,FALSE),FALSE)","v":false},{"$f":"IFERROR(IF(AND(VLOOKUP(FW12,'Feriados y días laborables'!$E$5:$F$11,2,0)=\"Si\",NOT(ISNUMBER(VLOOKUP(DATE($A$7,$A$9+1-1,FW11),Feriados,1,0)))),TRUE,FALSE),FALSE)","v":false},{"$f":"IFERROR(IF(AND(VLOOKUP(FX12,'Feriados y días laborables'!$E$5:$F$11,2,0)=\"Si\",NOT(ISNUMBER(VLOOKUP(DATE($A$7,$A$9+1-1,FX11),Feriados,1,0)))),TRUE,FALSE),FALSE)","v":false},{"$f":"IFERROR(IF(AND(VLOOKUP(FY12,'Feriados y días laborables'!$E$5:$F$11,2,0)=\"Si\",NOT(ISNUMBER(VLOOKUP(DATE($A$7,$A$9+1-1,FY11),Feriados,1,0)))),TRUE,FALSE),FALSE)","v":false},{"$f":"IFERROR(IF(AND(VLOOKUP(FZ12,'Feriados y días laborables'!$E$5:$F$11,2,0)=\"Si\",NOT(ISNUMBER(VLOOKUP(DATE($A$7,$A$9+1-1,FZ11),Feriados,1,0)))),TRUE,FALSE),FALSE)","v":false},{"$f":"IFERROR(IF(AND(VLOOKUP(GA12,'Feriados y días laborables'!$E$5:$F$11,2,0)=\"Si\",NOT(ISNUMBER(VLOOKUP(DATE($A$7,$A$9+1-1,GA11),Feriados,1,0)))),TRUE,FALSE),FALSE)","v":false},{"$f":"IFERROR(IF(AND(VLOOKUP(GB12,'Feriados y días laborables'!$E$5:$F$11,2,0)=\"Si\",NOT(ISNUMBER(VLOOKUP(DATE($A$7,$A$9+1-1,GB11),Feriados,1,0)))),TRUE,FALSE),FALSE)","v":false},{"$f":"IFERROR(IF(AND(VLOOKUP(GC12,'Feriados y días laborables'!$E$5:$F$11,2,0)=\"Si\",NOT(ISNUMBER(VLOOKUP(DATE($A$7,$A$9+1-1,GC11),Feriados,1,0)))),TRUE,FALSE),FALSE)","v":false},{"$f":"IFERROR(IF(AND(VLOOKUP(GD12,'Feriados y días laborables'!$E$5:$F$11,2,0)=\"Si\",NOT(ISNUMBER(VLOOKUP(DATE($A$7,$A$9+1-1,GD11),Feriados,1,0)))),TRUE,FALSE),FALSE)","v":false},{"$f":"IFERROR(IF(AND(VLOOKUP(GE12,'Feriados y días laborables'!$E$5:$F$11,2,0)=\"Si\",NOT(ISNUMBER(VLOOKUP(DATE($A$7,$A$9+1-1,GE11),Feriados,1,0)))),TRUE,FALSE),FALSE)","v":false},{"$f":"IFERROR(IF(AND(VLOOKUP(GF12,'Feriados y días laborables'!$E$5:$F$11,2,0)=\"Si\",NOT(ISNUMBER(VLOOKUP(DATE($A$7,$A$9+1-1,GF11),Feriados,1,0)))),TRUE,FALSE),FALSE)","v":false},{"$f":"IFERROR(IF(AND(VLOOKUP(GG12,'Feriados y días laborables'!$E$5:$F$11,2,0)=\"Si\",NOT(ISNUMBER(VLOOKUP(DATE($A$7,$A$9+1-1,GG11),Feriados,1,0)))),TRUE,FALSE),FALSE)","v":false},{"$f":"IFERROR(IF(AND(VLOOKUP(GH12,'Feriados y días laborables'!$E$5:$F$11,2,0)=\"Si\",NOT(ISNUMBER(VLOOKUP(DATE($A$7,$A$9+1-1,GH11),Feriados,1,0)))),TRUE,FALSE),FALSE)","v":false},{"$f":"IFERROR(IF(AND(VLOOKUP(GI12,'Feriados y días laborables'!$E$5:$F$11,2,0)=\"Si\",NOT(ISNUMBER(VLOOKUP(DATE($A$7,$A$9+1-1,GI11),Feriados,1,0)))),TRUE,FALSE),FALSE)","v":false},{"$f":"IFERROR(IF(AND(VLOOKUP(GJ12,'Feriados y días laborables'!$E$5:$F$11,2,0)=\"Si\",NOT(ISNUMBER(VLOOKUP(DATE($A$7,$A$9+1-1,GJ11),Feriados,1,0)))),TRUE,FALSE),FALSE)","v":false},{"$f":"IFERROR(IF(AND(VLOOKUP(GK12,'Feriados y días laborables'!$E$5:$F$11,2,0)=\"Si\",NOT(ISNUMBER(VLOOKUP(DATE($A$7,$A$9+1-1,GK11),Feriados,1,0)))),TRUE,FALSE),FALSE)","v":false},{"$f":"IFERROR(IF(AND(VLOOKUP(GL12,'Feriados y días laborables'!$E$5:$F$11,2,0)=\"Si\",NOT(ISNUMBER(VLOOKUP(DATE($A$7,$A$9+1-1,GL11),Feriados,1,0)))),TRUE,FALSE),FALSE)","v":false},{"$f":"IFERROR(IF(AND(VLOOKUP(GM12,'Feriados y días laborables'!$E$5:$F$11,2,0)=\"Si\",NOT(ISNUMBER(VLOOKUP(DATE($A$7,$A$9+1-1,GM11),Feriados,1,0)))),TRUE,FALSE),FALSE)","v":false},{"$f":"IFERROR(IF(AND(VLOOKUP(GN12,'Feriados y días laborables'!$E$5:$F$11,2,0)=\"Si\",NOT(ISNUMBER(VLOOKUP(DATE($A$7,$A$9+1-1,GN11),Feriados,1,0)))),TRUE,FALSE),FALSE)","v":false},{"$f":"IFERROR(IF(AND(VLOOKUP(GO12,'Feriados y días laborables'!$E$5:$F$11,2,0)=\"Si\",NOT(ISNUMBER(VLOOKUP(DATE($A$7,$A$9+1-1,GO11),Feriados,1,0)))),TRUE,FALSE),FALSE)","v":false},{"$f":"IFERROR(IF(AND(VLOOKUP(GP12,'Feriados y días laborables'!$E$5:$F$11,2,0)=\"Si\",NOT(ISNUMBER(VLOOKUP(DATE($A$7,$A$9+1-1,GP11),Feriados,1,0)))),TRUE,FALSE),FALSE)","v":false},{"$f":"IFERROR(IF(AND(VLOOKUP(GQ12,'Feriados y días laborables'!$E$5:$F$11,2,0)=\"Si\",NOT(ISNUMBER(VLOOKUP(DATE($A$7,$A$9+1-1,GQ11),Feriados,1,0)))),TRUE,FALSE),FALSE)","v":false},{"$f":"IFERROR(IF(AND(VLOOKUP(GR12,'Feriados y días laborables'!$E$5:$F$11,2,0)=\"Si\",NOT(ISNUMBER(VLOOKUP(DATE($A$7,$A$9+1-1,GR11),Feriados,1,0)))),TRUE,FALSE),FALSE)","v":false},{"$f":"IFERROR(IF(AND(VLOOKUP(GS12,'Feriados y días laborables'!$E$5:$F$11,2,0)=\"Si\",NOT(ISNUMBER(VLOOKUP(DATE($A$7,$A$9+1-1,GS11),Feriados,1,0)))),TRUE,FALSE),FALSE)","v":false},{"$f":"IFERROR(IF(AND(VLOOKUP(GT12,'Feriados y días laborables'!$E$5:$F$11,2,0)=\"Si\",NOT(ISNUMBER(VLOOKUP(DATE($A$7,$A$9+1-1,GT11),Feriados,1,0)))),TRUE,FALSE),FALSE)","v":false},{"$f":"IFERROR(IF(AND(VLOOKUP(GU12,'Feriados y días laborables'!$E$5:$F$11,2,0)=\"Si\",NOT(ISNUMBER(VLOOKUP(DATE($A$7,$A$9+1-1,GU11),Feriados,1,0)))),TRUE,FALSE),FALSE)","v":false},{"$f":"IFERROR(IF(AND(VLOOKUP(GV12,'Feriados y días laborables'!$E$5:$F$11,2,0)=\"Si\",NOT(ISNUMBER(VLOOKUP(DATE($A$7,$A$9+1-1,GV11),Feriados,1,0)))),TRUE,FALSE),FALSE)","v":false},{"$f":"IFERROR(IF(AND(VLOOKUP(GW12,'Feriados y días laborables'!$E$5:$F$11,2,0)=\"Si\",NOT(ISNUMBER(VLOOKUP(DATE($A$7,$A$9+1-1,GW11),Feriados,1,0)))),TRUE,FALSE),FALSE)","v":false},{"$f":"IFERROR(IF(AND(VLOOKUP(GX12,'Feriados y días laborables'!$E$5:$F$11,2,0)=\"Si\",NOT(ISNUMBER(VLOOKUP(DATE($A$7,$A$9+1-1,GX11),Feriados,1,0)))),TRUE,FALSE),FALSE)","v":false},{"$f":"IFERROR(IF(AND(VLOOKUP(GY12,'Feriados y días laborables'!$E$5:$F$11,2,0)=\"Si\",NOT(ISNUMBER(VLOOKUP(DATE($A$7,$A$9+1-1,GY11),Feriados,1,0)))),TRUE,FALSE),FALSE)","v":false},{"$f":"IFERROR(IF(AND(VLOOKUP(GZ12,'Feriados y días laborables'!$E$5:$F$11,2,0)=\"Si\",NOT(ISNUMBER(VLOOKUP(DATE($A$7,$A$9+1-1,GZ11),Feriados,1,0)))),TRUE,FALSE),FALSE)","v":false},{"$f":"IFERROR(IF(AND(VLOOKUP(HA12,'Feriados y días laborables'!$E$5:$F$11,2,0)=\"Si\",NOT(ISNUMBER(VLOOKUP(DATE($A$7,$A$9+1-1,HA11),Feriados,1,0)))),TRUE,FALSE),FALSE)","v":false},{"$f":"IFERROR(IF(AND(VLOOKUP(HB12,'Feriados y días laborables'!$E$5:$F$11,2,0)=\"Si\",NOT(ISNUMBER(VLOOKUP(DATE($A$7,$A$9+1-1,HB11),Feriados,1,0)))),TRUE,FALSE),FALSE)","v":false},{"$f":"IFERROR(IF(AND(VLOOKUP(HC12,'Feriados y días laborables'!$E$5:$F$11,2,0)=\"Si\",NOT(ISNUMBER(VLOOKUP(DATE($A$7,$A$9+1-1,HC11),Feriados,1,0)))),TRUE,FALSE),FALSE)","v":false},{"$f":"IFERROR(IF(AND(VLOOKUP(HD12,'Feriados y días laborables'!$E$5:$F$11,2,0)=\"Si\",NOT(ISNUMBER(VLOOKUP(DATE($A$7,$A$9+1-1,HD11),Feriados,1,0)))),TRUE,FALSE),FALSE)","v":false},{"$f":"IFERROR(IF(AND(VLOOKUP(HE12,'Feriados y días laborables'!$E$5:$F$11,2,0)=\"Si\",NOT(ISNUMBER(VLOOKUP(DATE($A$7,$A$9+1-1,HE11),Feriados,1,0)))),TRUE,FALSE),FALSE)","v":false},{"$f":"IFERROR(IF(AND(VLOOKUP(HF12,'Feriados y días laborables'!$E$5:$F$11,2,0)=\"Si\",NOT(ISNUMBER(VLOOKUP(DATE($A$7,$A$9+1-1,HF11),Feriados,1,0)))),TRUE,FALSE),FALSE)","v":false},{"$f":"IFERROR(IF(AND(VLOOKUP(HG12,'Feriados y días laborables'!$E$5:$F$11,2,0)=\"Si\",NOT(ISNUMBER(VLOOKUP(DATE($A$7,$A$9+1-1,HG11),Feriados,1,0)))),TRUE,FALSE),FALSE)","v":false},{"$f":"IFERROR(IF(AND(VLOOKUP(HH12,'Feriados y días laborables'!$E$5:$F$11,2,0)=\"Si\",NOT(ISNUMBER(VLOOKUP(DATE($A$7,$A$9+1-1,HH11),Feriados,1,0)))),TRUE,FALSE),FALSE)","v":false},{"$f":"IFERROR(IF(AND(VLOOKUP(HI12,'Feriados y días laborables'!$E$5:$F$11,2,0)=\"Si\",NOT(ISNUMBER(VLOOKUP(DATE($A$7,$A$9+1-1,HI11),Feriados,1,0)))),TRUE,FALSE),FALSE)","v":false},{"$f":"IFERROR(IF(AND(VLOOKUP(HJ12,'Feriados y días laborables'!$E$5:$F$11,2,0)=\"Si\",NOT(ISNUMBER(VLOOKUP(DATE($A$7,$A$9+1-1,HJ11),Feriados,1,0)))),TRUE,FALSE),FALSE)","v":false},{"$f":"IFERROR(IF(AND(VLOOKUP(HK12,'Feriados y días laborables'!$E$5:$F$11,2,0)=\"Si\",NOT(ISNUMBER(VLOOKUP(DATE($A$7,$A$9+1-1,HK11),Feriados,1,0)))),TRUE,FALSE),FALSE)","v":false},{"$f":"IFERROR(IF(AND(VLOOKUP(HL12,'Feriados y días laborables'!$E$5:$F$11,2,0)=\"Si\",NOT(ISNUMBER(VLOOKUP(DATE($A$7,$A$9+1-1,HL11),Feriados,1,0)))),TRUE,FALSE),FALSE)","v":false},{"$f":"IFERROR(IF(AND(VLOOKUP(HM12,'Feriados y días laborables'!$E$5:$F$11,2,0)=\"Si\",NOT(ISNUMBER(VLOOKUP(DATE($A$7,$A$9+1-1,HM11),Feriados,1,0)))),TRUE,FALSE),FALSE)","v":false},{"$f":"IFERROR(IF(AND(VLOOKUP(HN12,'Feriados y días laborables'!$E$5:$F$11,2,0)=\"Si\",NOT(ISNUMBER(VLOOKUP(DATE($A$7,$A$9+1-1,HN11),Feriados,1,0)))),TRUE,FALSE),FALSE)","v":false},{"$f":"IFERROR(IF(AND(VLOOKUP(HO12,'Feriados y días laborables'!$E$5:$F$11,2,0)=\"Si\",NOT(ISNUMBER(VLOOKUP(DATE($A$7,$A$9+1-1,HO11),Feriados,1,0)))),TRUE,FALSE),FALSE)","v":false},{"$f":"IFERROR(IF(AND(VLOOKUP(HP12,'Feriados y días laborables'!$E$5:$F$11,2,0)=\"Si\",NOT(ISNUMBER(VLOOKUP(DATE($A$7,$A$9+1-1,HP11),Feriados,1,0)))),TRUE,FALSE),FALSE)","v":false},{"$f":"IFERROR(IF(AND(VLOOKUP(HQ12,'Feriados y días laborables'!$E$5:$F$11,2,0)=\"Si\",NOT(ISNUMBER(VLOOKUP(DATE($A$7,$A$9+1-1,HQ11),Feriados,1,0)))),TRUE,FALSE),FALSE)","v":false},{"$f":"IFERROR(IF(AND(VLOOKUP(HR12,'Feriados y días laborables'!$E$5:$F$11,2,0)=\"Si\",NOT(ISNUMBER(VLOOKUP(DATE($A$7,$A$9+1-1,HR11),Feriados,1,0)))),TRUE,FALSE),FALSE)","v":false},{"$f":"IFERROR(IF(AND(VLOOKUP(HS12,'Feriados y días laborables'!$E$5:$F$11,2,0)=\"Si\",NOT(ISNUMBER(VLOOKUP(DATE($A$7,$A$9+1-1,HS11),Feriados,1,0)))),TRUE,FALSE),FALSE)","v":false},{"$f":"IFERROR(IF(AND(VLOOKUP(HT12,'Feriados y días laborables'!$E$5:$F$11,2,0)=\"Si\",NOT(ISNUMBER(VLOOKUP(DATE($A$7,$A$9+1-1,HT11),Feriados,1,0)))),TRUE,FALSE),FALSE)","v":false},{"$f":"IFERROR(IF(AND(VLOOKUP(HU12,'Feriados y días laborables'!$E$5:$F$11,2,0)=\"Si\",NOT(ISNUMBER(VLOOKUP(DATE($A$7,$A$9+1-1,HU11),Feriados,1,0)))),TRUE,FALSE),FALSE)","v":false},{"$f":"IFERROR(IF(AND(VLOOKUP(HV12,'Feriados y días laborables'!$E$5:$F$11,2,0)=\"Si\",NOT(ISNUMBER(VLOOKUP(DATE($A$7,$A$9+1-1,HV11),Feriados,1,0)))),TRUE,FALSE),FALSE)","v":false},{"$f":"IFERROR(IF(AND(VLOOKUP(HW12,'Feriados y días laborables'!$E$5:$F$11,2,0)=\"Si\",NOT(ISNUMBER(VLOOKUP(DATE($A$7,$A$9+1-1,HW11),Feriados,1,0)))),TRUE,FALSE),FALSE)","v":false},{"$f":"IFERROR(IF(AND(VLOOKUP(HX12,'Feriados y días laborables'!$E$5:$F$11,2,0)=\"Si\",NOT(ISNUMBER(VLOOKUP(DATE($A$7,$A$9+1-1,HX11),Feriados,1,0)))),TRUE,FALSE),FALSE)","v":false},{"$f":"IFERROR(IF(AND(VLOOKUP(HY12,'Feriados y días laborables'!$E$5:$F$11,2,0)=\"Si\",NOT(ISNUMBER(VLOOKUP(DATE($A$7,$A$9+1-1,HY11),Feriados,1,0)))),TRUE,FALSE),FALSE)","v":false},{"$f":"IFERROR(IF(AND(VLOOKUP(HZ12,'Feriados y días laborables'!$E$5:$F$11,2,0)=\"Si\",NOT(ISNUMBER(VLOOKUP(DATE($A$7,$A$9+1-1,HZ11),Feriados,1,0)))),TRUE,FALSE),FALSE)","v":false},{"$f":"IFERROR(IF(AND(VLOOKUP(IA12,'Feriados y días laborables'!$E$5:$F$11,2,0)=\"Si\",NOT(ISNUMBER(VLOOKUP(DATE($A$7,$A$9+1-1,IA11),Feriados,1,0)))),TRUE,FALSE),FALSE)","v":false},{"$f":"IFERROR(IF(AND(VLOOKUP(IB12,'Feriados y días laborables'!$E$5:$F$11,2,0)=\"Si\",NOT(ISNUMBER(VLOOKUP(DATE($A$7,$A$9+1-1,IB11),Feriados,1,0)))),TRUE,FALSE),FALSE)","v":false},{"$f":"IFERROR(IF(AND(VLOOKUP(IC12,'Feriados y días laborables'!$E$5:$F$11,2,0)=\"Si\",NOT(ISNUMBER(VLOOKUP(DATE($A$7,$A$9+1-1,IC11),Feriados,1,0)))),TRUE,FALSE),FALSE)","v":false},{"$f":"IFERROR(IF(AND(VLOOKUP(ID12,'Feriados y días laborables'!$E$5:$F$11,2,0)=\"Si\",NOT(ISNUMBER(VLOOKUP(DATE($A$7,$A$9+1-1,ID11),Feriados,1,0)))),TRUE,FALSE),FALSE)","v":false},{"$f":"IFERROR(IF(AND(VLOOKUP(IE12,'Feriados y días laborables'!$E$5:$F$11,2,0)=\"Si\",NOT(ISNUMBER(VLOOKUP(DATE($A$7,$A$9+1-1,IE11),Feriados,1,0)))),TRUE,FALSE),FALSE)","v":false},{"$f":"IFERROR(IF(AND(VLOOKUP(IF12,'Feriados y días laborables'!$E$5:$F$11,2,0)=\"Si\",NOT(ISNUMBER(VLOOKUP(DATE($A$7,$A$9+1-1,IF11),Feriados,1,0)))),TRUE,FALSE),FALSE)","v":false},{"$f":"IFERROR(IF(AND(VLOOKUP(IG12,'Feriados y días laborables'!$E$5:$F$11,2,0)=\"Si\",NOT(ISNUMBER(VLOOKUP(DATE($A$7,$A$9+1-1,IG11),Feriados,1,0)))),TRUE,FALSE),FALSE)","v":false},{"$f":"IFERROR(IF(AND(VLOOKUP(IH12,'Feriados y días laborables'!$E$5:$F$11,2,0)=\"Si\",NOT(ISNUMBER(VLOOKUP(DATE($A$7,$A$9+1-1,IH11),Feriados,1,0)))),TRUE,FALSE),FALSE)","v":false},{"$f":"IFERROR(IF(AND(VLOOKUP(II12,'Feriados y días laborables'!$E$5:$F$11,2,0)=\"Si\",NOT(ISNUMBER(VLOOKUP(DATE($A$7,$A$9+1-1,II11),Feriados,1,0)))),TRUE,FALSE),FALSE)","v":false},{"$f":"IFERROR(IF(AND(VLOOKUP(IJ12,'Feriados y días laborables'!$E$5:$F$11,2,0)=\"Si\",NOT(ISNUMBER(VLOOKUP(DATE($A$7,$A$9+1-1,IJ11),Feriados,1,0)))),TRUE,FALSE),FALSE)","v":false},{"$f":"IFERROR(IF(AND(VLOOKUP(IK12,'Feriados y días laborables'!$E$5:$F$11,2,0)=\"Si\",NOT(ISNUMBER(VLOOKUP(DATE($A$7,$A$9+1-1,IK11),Feriados,1,0)))),TRUE,FALSE),FALSE)","v":false},{"$f":"IFERROR(IF(AND(VLOOKUP(IL12,'Feriados y días laborables'!$E$5:$F$11,2,0)=\"Si\",NOT(ISNUMBER(VLOOKUP(DATE($A$7,$A$9+1-1,IL11),Feriados,1,0)))),TRUE,FALSE),FALSE)","v":false},{"$f":"IFERROR(IF(AND(VLOOKUP(IM12,'Feriados y días laborables'!$E$5:$F$11,2,0)=\"Si\",NOT(ISNUMBER(VLOOKUP(DATE($A$7,$A$9+1-1,IM11),Feriados,1,0)))),TRUE,FALSE),FALSE)","v":false},{"$f":"IFERROR(IF(AND(VLOOKUP(IN12,'Feriados y días laborables'!$E$5:$F$11,2,0)=\"Si\",NOT(ISNUMBER(VLOOKUP(DATE($A$7,$A$9+1-1,IN11),Feriados,1,0)))),TRUE,FALSE),FALSE)","v":false},{"$f":"IFERROR(IF(AND(VLOOKUP(IO12,'Feriados y días laborables'!$E$5:$F$11,2,0)=\"Si\",NOT(ISNUMBER(VLOOKUP(DATE($A$7,$A$9+1-1,IO11),Feriados,1,0)))),TRUE,FALSE),FALSE)","v":false},{"$f":"IFERROR(IF(AND(VLOOKUP(IP12,'Feriados y días laborables'!$E$5:$F$11,2,0)=\"Si\",NOT(ISNUMBER(VLOOKUP(DATE($A$7,$A$9+1-1,IP11),Feriados,1,0)))),TRUE,FALSE),FALSE)","v":false},{"$f":"IFERROR(IF(AND(VLOOKUP(IQ12,'Feriados y días laborables'!$E$5:$F$11,2,0)=\"Si\",NOT(ISNUMBER(VLOOKUP(DATE($A$7,$A$9+1-1,IQ11),Feriados,1,0)))),TRUE,FALSE),FALSE)","v":false},{"$f":"IFERROR(IF(AND(VLOOKUP(IR12,'Feriados y días laborables'!$E$5:$F$11,2,0)=\"Si\",NOT(ISNUMBER(VLOOKUP(DATE($A$7,$A$9+1-1,IR11),Feriados,1,0)))),TRUE,FALSE),FALSE)","v":false},{"$f":"IFERROR(IF(AND(VLOOKUP(IS12,'Feriados y días laborables'!$E$5:$F$11,2,0)=\"Si\",NOT(ISNUMBER(VLOOKUP(DATE($A$7,$A$9+1-1,IS11),Feriados,1,0)))),TRUE,FALSE),FALSE)","v":false},{"$f":"IFERROR(IF(AND(VLOOKUP(IT12,'Feriados y días laborables'!$E$5:$F$11,2,0)=\"Si\",NOT(ISNUMBER(VLOOKUP(DATE($A$7,$A$9+1-1,IT11),Feriados,1,0)))),TRUE,FALSE),FALSE)","v":false},{"$f":"IFERROR(IF(AND(VLOOKUP(IU12,'Feriados y días laborables'!$E$5:$F$11,2,0)=\"Si\",NOT(ISNUMBER(VLOOKUP(DATE($A$7,$A$9+1-1,IU11),Feriados,1,0)))),TRUE,FALSE),FALSE)","v":false},{"$f":"IFERROR(IF(AND(VLOOKUP(IV12,'Feriados y días laborables'!$E$5:$F$11,2,0)=\"Si\",NOT(ISNUMBER(VLOOKUP(DATE($A$7,$A$9+1-1,IV11),Feriados,1,0)))),TRUE,FALSE),FALSE)","v":false},{"$f":"IFERROR(IF(AND(VLOOKUP(IW12,'Feriados y días laborables'!$E$5:$F$11,2,0)=\"Si\",NOT(ISNUMBER(VLOOKUP(DATE($A$7,$A$9+1-1,IW11),Feriados,1,0)))),TRUE,FALSE),FALSE)","v":false},{"$f":"IFERROR(IF(AND(VLOOKUP(IX12,'Feriados y días laborables'!$E$5:$F$11,2,0)=\"Si\",NOT(ISNUMBER(VLOOKUP(DATE($A$7,$A$9+1-1,IX11),Feriados,1,0)))),TRUE,FALSE),FALSE)","v":false},{"$f":"IFERROR(IF(AND(VLOOKUP(IY12,'Feriados y días laborables'!$E$5:$F$11,2,0)=\"Si\",NOT(ISNUMBER(VLOOKUP(DATE($A$7,$A$9+1-1,IY11),Feriados,1,0)))),TRUE,FALSE),FALSE)","v":false},{"$f":"IFERROR(IF(AND(VLOOKUP(IZ12,'Feriados y días laborables'!$E$5:$F$11,2,0)=\"Si\",NOT(ISNUMBER(VLOOKUP(DATE($A$7,$A$9+1-1,IZ11),Feriados,1,0)))),TRUE,FALSE),FALSE)","v":false},{"$f":"IFERROR(IF(AND(VLOOKUP(JA12,'Feriados y días laborables'!$E$5:$F$11,2,0)=\"Si\",NOT(ISNUMBER(VLOOKUP(DATE($A$7,$A$9+1-1,JA11),Feriados,1,0)))),TRUE,FALSE),FALSE)","v":false},{"$f":"IFERROR(IF(AND(VLOOKUP(JB12,'Feriados y días laborables'!$E$5:$F$11,2,0)=\"Si\",NOT(ISNUMBER(VLOOKUP(DATE($A$7,$A$9+1-1,JB11),Feriados,1,0)))),TRUE,FALSE),FALSE)","v":false},{"$f":"IFERROR(IF(AND(VLOOKUP(JC12,'Feriados y días laborables'!$E$5:$F$11,2,0)=\"Si\",NOT(ISNUMBER(VLOOKUP(DATE($A$7,$A$9+1-1,JC11),Feriados,1,0)))),TRUE,FALSE),FALSE)","v":false},{"$f":"IFERROR(IF(AND(VLOOKUP(JD12,'Feriados y días laborables'!$E$5:$F$11,2,0)=\"Si\",NOT(ISNUMBER(VLOOKUP(DATE($A$7,$A$9+1-1,JD11),Feriados,1,0)))),TRUE,FALSE),FALSE)","v":false},{"$f":"IFERROR(IF(AND(VLOOKUP(JE12,'Feriados y días laborables'!$E$5:$F$11,2,0)=\"Si\",NOT(ISNUMBER(VLOOKUP(DATE($A$7,$A$9+1-1,JE11),Feriados,1,0)))),TRUE,FALSE),FALSE)","v":false},{"$f":"IFERROR(IF(AND(VLOOKUP(JF12,'Feriados y días laborables'!$E$5:$F$11,2,0)=\"Si\",NOT(ISNUMBER(VLOOKUP(DATE($A$7,$A$9+1-1,JF11),Feriados,1,0)))),TRUE,FALSE),FALSE)","v":false},{"$f":"IFERROR(IF(AND(VLOOKUP(JG12,'Feriados y días laborables'!$E$5:$F$11,2,0)=\"Si\",NOT(ISNUMBER(VLOOKUP(DATE($A$7,$A$9+1-1,JG11),Feriados,1,0)))),TRUE,FALSE),FALSE)","v":false},{"$f":"IFERROR(IF(AND(VLOOKUP(JH12,'Feriados y días laborables'!$E$5:$F$11,2,0)=\"Si\",NOT(ISNUMBER(VLOOKUP(DATE($A$7,$A$9+1-1,JH11),Feriados,1,0)))),TRUE,FALSE),FALSE)","v":false},{"$f":"IFERROR(IF(AND(VLOOKUP(JI12,'Feriados y días laborables'!$E$5:$F$11,2,0)=\"Si\",NOT(ISNUMBER(VLOOKUP(DATE($A$7,$A$9+1-1,JI11),Feriados,1,0)))),TRUE,FALSE),FALSE)","v":false},{"$f":"IFERROR(IF(AND(VLOOKUP(JJ12,'Feriados y días laborables'!$E$5:$F$11,2,0)=\"Si\",NOT(ISNUMBER(VLOOKUP(DATE($A$7,$A$9+1-1,JJ11),Feriados,1,0)))),TRUE,FALSE),FALSE)","v":false},{"$f":"IFERROR(IF(AND(VLOOKUP(JK12,'Feriados y días laborables'!$E$5:$F$11,2,0)=\"Si\",NOT(ISNUMBER(VLOOKUP(DATE($A$7,$A$9+1-1,JK11),Feriados,1,0)))),TRUE,FALSE),FALSE)","v":false},{"$f":"IFERROR(IF(AND(VLOOKUP(JL12,'Feriados y días laborables'!$E$5:$F$11,2,0)=\"Si\",NOT(ISNUMBER(VLOOKUP(DATE($A$7,$A$9+1-1,JL11),Feriados,1,0)))),TRUE,FALSE),FALSE)","v":false},{"$f":"IFERROR(IF(AND(VLOOKUP(JM12,'Feriados y días laborables'!$E$5:$F$11,2,0)=\"Si\",NOT(ISNUMBER(VLOOKUP(DATE($A$7,$A$9+1-1,JM11),Feriados,1,0)))),TRUE,FALSE),FALSE)","v":false},{"$f":"IFERROR(IF(AND(VLOOKUP(JN12,'Feriados y días laborables'!$E$5:$F$11,2,0)=\"Si\",NOT(ISNUMBER(VLOOKUP(DATE($A$7,$A$9+1-1,JN11),Feriados,1,0)))),TRUE,FALSE),FALSE)","v":false},{"$f":"IFERROR(IF(AND(VLOOKUP(JO12,'Feriados y días laborables'!$E$5:$F$11,2,0)=\"Si\",NOT(ISNUMBER(VLOOKUP(DATE($A$7,$A$9+1-1,JO11),Feriados,1,0)))),TRUE,FALSE),FALSE)","v":false},{"$f":"IFERROR(IF(AND(VLOOKUP(JP12,'Feriados y días laborables'!$E$5:$F$11,2,0)=\"Si\",NOT(ISNUMBER(VLOOKUP(DATE($A$7,$A$9+1-1,JP11),Feriados,1,0)))),TRUE,FALSE),FALSE)","v":false},{"$f":"IFERROR(IF(AND(VLOOKUP(JQ12,'Feriados y días laborables'!$E$5:$F$11,2,0)=\"Si\",NOT(ISNUMBER(VLOOKUP(DATE($A$7,$A$9+1-1,JQ11),Feriados,1,0)))),TRUE,FALSE),FALSE)","v":false},{"$f":"IFERROR(IF(AND(VLOOKUP(JR12,'Feriados y días laborables'!$E$5:$F$11,2,0)=\"Si\",NOT(ISNUMBER(VLOOKUP(DATE($A$7,$A$9+1-1,JR11),Feriados,1,0)))),TRUE,FALSE),FALSE)","v":false},{"$f":"IFERROR(IF(AND(VLOOKUP(JS12,'Feriados y días laborables'!$E$5:$F$11,2,0)=\"Si\",NOT(ISNUMBER(VLOOKUP(DATE($A$7,$A$9+1-1,JS11),Feriados,1,0)))),TRUE,FALSE),FALSE)","v":false},{"$f":"IFERROR(IF(AND(VLOOKUP(JT12,'Feriados y días laborables'!$E$5:$F$11,2,0)=\"Si\",NOT(ISNUMBER(VLOOKUP(DATE($A$7,$A$9+1-1,JT11),Feriados,1,0)))),TRUE,FALSE),FALSE)","v":false},{"$f":"IFERROR(IF(AND(VLOOKUP(JU12,'Feriados y días laborables'!$E$5:$F$11,2,0)=\"Si\",NOT(ISNUMBER(VLOOKUP(DATE($A$7,$A$9+1-1,JU11),Feriados,1,0)))),TRUE,FALSE),FALSE)","v":false},{"$f":"IFERROR(IF(AND(VLOOKUP(JV12,'Feriados y días laborables'!$E$5:$F$11,2,0)=\"Si\",NOT(ISNUMBER(VLOOKUP(DATE($A$7,$A$9+1-1,JV11),Feriados,1,0)))),TRUE,FALSE),FALSE)","v":false},{"$f":"IFERROR(IF(AND(VLOOKUP(JW12,'Feriados y días laborables'!$E$5:$F$11,2,0)=\"Si\",NOT(ISNUMBER(VLOOKUP(DATE($A$7,$A$9+1-1,JW11),Feriados,1,0)))),TRUE,FALSE),FALSE)","v":false},{"$f":"IFERROR(IF(AND(VLOOKUP(JX12,'Feriados y días laborables'!$E$5:$F$11,2,0)=\"Si\",NOT(ISNUMBER(VLOOKUP(DATE($A$7,$A$9+1-1,JX11),Feriados,1,0)))),TRUE,FALSE),FALSE)","v":false},{"$f":"IFERROR(IF(AND(VLOOKUP(JY12,'Feriados y días laborables'!$E$5:$F$11,2,0)=\"Si\",NOT(ISNUMBER(VLOOKUP(DATE($A$7,$A$9+1-1,JY11),Feriados,1,0)))),TRUE,FALSE),FALSE)","v":false},{"$f":"IFERROR(IF(AND(VLOOKUP(JZ12,'Feriados y días laborables'!$E$5:$F$11,2,0)=\"Si\",NOT(ISNUMBER(VLOOKUP(DATE($A$7,$A$9+1-1,JZ11),Feriados,1,0)))),TRUE,FALSE),FALSE)","v":false},{"$f":"IFERROR(IF(AND(VLOOKUP(KA12,'Feriados y días laborables'!$E$5:$F$11,2,0)=\"Si\",NOT(ISNUMBER(VLOOKUP(DATE($A$7,$A$9+1-1,KA11),Feriados,1,0)))),TRUE,FALSE),FALSE)","v":false},{"$f":"IFERROR(IF(AND(VLOOKUP(KB12,'Feriados y días laborables'!$E$5:$F$11,2,0)=\"Si\",NOT(ISNUMBER(VLOOKUP(DATE($A$7,$A$9+1-1,KB11),Feriados,1,0)))),TRUE,FALSE),FALSE)","v":false},{"$f":"IFERROR(IF(AND(VLOOKUP(KC12,'Feriados y días laborables'!$E$5:$F$11,2,0)=\"Si\",NOT(ISNUMBER(VLOOKUP(DATE($A$7,$A$9+1-1,KC11),Feriados,1,0)))),TRUE,FALSE),FALSE)","v":false},{"$f":"IFERROR(IF(AND(VLOOKUP(KD12,'Feriados y días laborables'!$E$5:$F$11,2,0)=\"Si\",NOT(ISNUMBER(VLOOKUP(DATE($A$7,$A$9+1-1,KD11),Feriados,1,0)))),TRUE,FALSE),FALSE)","v":false},{"$f":"IFERROR(IF(AND(VLOOKUP(KE12,'Feriados y días laborables'!$E$5:$F$11,2,0)=\"Si\",NOT(ISNUMBER(VLOOKUP(DATE($A$7,$A$9+1-1,KE11),Feriados,1,0)))),TRUE,FALSE),FALSE)","v":false},{"$f":"IFERROR(IF(AND(VLOOKUP(KF12,'Feriados y días laborables'!$E$5:$F$11,2,0)=\"Si\",NOT(ISNUMBER(VLOOKUP(DATE($A$7,$A$9+1-1,KF11),Feriados,1,0)))),TRUE,FALSE),FALSE)","v":false},{"$f":"IFERROR(IF(AND(VLOOKUP(KG12,'Feriados y días laborables'!$E$5:$F$11,2,0)=\"Si\",NOT(ISNUMBER(VLOOKUP(DATE($A$7,$A$9+1-1,KG11),Feriados,1,0)))),TRUE,FALSE),FALSE)","v":false},{"$f":"IFERROR(IF(AND(VLOOKUP(KH12,'Feriados y días laborables'!$E$5:$F$11,2,0)=\"Si\",NOT(ISNUMBER(VLOOKUP(DATE($A$7,$A$9+1-1,KH11),Feriados,1,0)))),TRUE,FALSE),FALSE)","v":false},{"$f":"IFERROR(IF(AND(VLOOKUP(KI12,'Feriados y días laborables'!$E$5:$F$11,2,0)=\"Si\",NOT(ISNUMBER(VLOOKUP(DATE($A$7,$A$9+1-1,KI11),Feriados,1,0)))),TRUE,FALSE),FALSE)","v":false},{"$f":"IFERROR(IF(AND(VLOOKUP(KJ12,'Feriados y días laborables'!$E$5:$F$11,2,0)=\"Si\",NOT(ISNUMBER(VLOOKUP(DATE($A$7,$A$9+1-1,KJ11),Feriados,1,0)))),TRUE,FALSE),FALSE)","v":false},{"$f":"IFERROR(IF(AND(VLOOKUP(KK12,'Feriados y días laborables'!$E$5:$F$11,2,0)=\"Si\",NOT(ISNUMBER(VLOOKUP(DATE($A$7,$A$9+1-1,KK11),Feriados,1,0)))),TRUE,FALSE),FALSE)","v":false},{"$f":"IFERROR(IF(AND(VLOOKUP(KL12,'Feriados y días laborables'!$E$5:$F$11,2,0)=\"Si\",NOT(ISNUMBER(VLOOKUP(DATE($A$7,$A$9+1-1,KL11),Feriados,1,0)))),TRUE,FALSE),FALSE)","v":false},{"$f":"IFERROR(IF(AND(VLOOKUP(KM12,'Feriados y días laborables'!$E$5:$F$11,2,0)=\"Si\",NOT(ISNUMBER(VLOOKUP(DATE($A$7,$A$9+1-1,KM11),Feriados,1,0)))),TRUE,FALSE),FALSE)","v":false},{"$f":"IFERROR(IF(AND(VLOOKUP(KN12,'Feriados y días laborables'!$E$5:$F$11,2,0)=\"Si\",NOT(ISNUMBER(VLOOKUP(DATE($A$7,$A$9+1-1,KN11),Feriados,1,0)))),TRUE,FALSE),FALSE)","v":false},{"$f":"IFERROR(IF(AND(VLOOKUP(KO12,'Feriados y días laborables'!$E$5:$F$11,2,0)=\"Si\",NOT(ISNUMBER(VLOOKUP(DATE($A$7,$A$9+1-1,KO11),Feriados,1,0)))),TRUE,FALSE),FALSE)","v":false},{"$f":"IFERROR(IF(AND(VLOOKUP(KP12,'Feriados y días laborables'!$E$5:$F$11,2,0)=\"Si\",NOT(ISNUMBER(VLOOKUP(DATE($A$7,$A$9+1-1,KP11),Feriados,1,0)))),TRUE,FALSE),FALSE)","v":false},{"$f":"IFERROR(IF(AND(VLOOKUP(KQ12,'Feriados y días laborables'!$E$5:$F$11,2,0)=\"Si\",NOT(ISNUMBER(VLOOKUP(DATE($A$7,$A$9+1-1,KQ11),Feriados,1,0)))),TRUE,FALSE),FALSE)","v":false},{"$f":"IFERROR(IF(AND(VLOOKUP(KR12,'Feriados y días laborables'!$E$5:$F$11,2,0)=\"Si\",NOT(ISNUMBER(VLOOKUP(DATE($A$7,$A$9+1-1,KR11),Feriados,1,0)))),TRUE,FALSE),FALSE)","v":false},{"$f":"IFERROR(IF(AND(VLOOKUP(KS12,'Feriados y días laborables'!$E$5:$F$11,2,0)=\"Si\",NOT(ISNUMBER(VLOOKUP(DATE($A$7,$A$9+1-1,KS11),Feriados,1,0)))),TRUE,FALSE),FALSE)","v":false},{"$f":"IFERROR(IF(AND(VLOOKUP(KT12,'Feriados y días laborables'!$E$5:$F$11,2,0)=\"Si\",NOT(ISNUMBER(VLOOKUP(DATE($A$7,$A$9+1-1,KT11),Feriados,1,0)))),TRUE,FALSE),FALSE)","v":false},{"$f":"IFERROR(IF(AND(VLOOKUP(KU12,'Feriados y días laborables'!$E$5:$F$11,2,0)=\"Si\",NOT(ISNUMBER(VLOOKUP(DATE($A$7,$A$9+1-1,KU11),Feriados,1,0)))),TRUE,FALSE),FALSE)","v":false},{"$f":"IFERROR(IF(AND(VLOOKUP(KV12,'Feriados y días laborables'!$E$5:$F$11,2,0)=\"Si\",NOT(ISNUMBER(VLOOKUP(DATE($A$7,$A$9+1-1,KV11),Feriados,1,0)))),TRUE,FALSE),FALSE)","v":false},{"$f":"IFERROR(IF(AND(VLOOKUP(KW12,'Feriados y días laborables'!$E$5:$F$11,2,0)=\"Si\",NOT(ISNUMBER(VLOOKUP(DATE($A$7,$A$9+1-1,KW11),Feriados,1,0)))),TRUE,FALSE),FALSE)","v":false},{"$f":"IFERROR(IF(AND(VLOOKUP(KX12,'Feriados y días laborables'!$E$5:$F$11,2,0)=\"Si\",NOT(ISNUMBER(VLOOKUP(DATE($A$7,$A$9+1-1,KX11),Feriados,1,0)))),TRUE,FALSE),FALSE)","v":false},{"$f":"IFERROR(IF(AND(VLOOKUP(KY12,'Feriados y días laborables'!$E$5:$F$11,2,0)=\"Si\",NOT(ISNUMBER(VLOOKUP(DATE($A$7,$A$9+1-1,KY11),Feriados,1,0)))),TRUE,FALSE),FALSE)","v":false},{"$f":"IFERROR(IF(AND(VLOOKUP(KZ12,'Feriados y días laborables'!$E$5:$F$11,2,0)=\"Si\",NOT(ISNUMBER(VLOOKUP(DATE($A$7,$A$9+1-1,KZ11),Feriados,1,0)))),TRUE,FALSE),FALSE)","v":false},{"$f":"IFERROR(IF(AND(VLOOKUP(LA12,'Feriados y días laborables'!$E$5:$F$11,2,0)=\"Si\",NOT(ISNUMBER(VLOOKUP(DATE($A$7,$A$9+1-1,LA11),Feriados,1,0)))),TRUE,FALSE),FALSE)","v":false},{"$f":"IFERROR(IF(AND(VLOOKUP(LB12,'Feriados y días laborables'!$E$5:$F$11,2,0)=\"Si\",NOT(ISNUMBER(VLOOKUP(DATE($A$7,$A$9+1-1,LB11),Feriados,1,0)))),TRUE,FALSE),FALSE)","v":false},{"$f":"IFERROR(IF(AND(VLOOKUP(LC12,'Feriados y días laborables'!$E$5:$F$11,2,0)=\"Si\",NOT(ISNUMBER(VLOOKUP(DATE($A$7,$A$9+1-1,LC11),Feriados,1,0)))),TRUE,FALSE),FALSE)","v":false},{"$f":"IFERROR(IF(AND(VLOOKUP(LD12,'Feriados y días laborables'!$E$5:$F$11,2,0)=\"Si\",NOT(ISNUMBER(VLOOKUP(DATE($A$7,$A$9+1-1,LD11),Feriados,1,0)))),TRUE,FALSE),FALSE)","v":false},{"$f":"IFERROR(IF(AND(VLOOKUP(LE12,'Feriados y días laborables'!$E$5:$F$11,2,0)=\"Si\",NOT(ISNUMBER(VLOOKUP(DATE($A$7,$A$9+1-1,LE11),Feriados,1,0)))),TRUE,FALSE),FALSE)","v":false},{"$f":"IFERROR(IF(AND(VLOOKUP(LF12,'Feriados y días laborables'!$E$5:$F$11,2,0)=\"Si\",NOT(ISNUMBER(VLOOKUP(DATE($A$7,$A$9+1-1,LF11),Feriados,1,0)))),TRUE,FALSE),FALSE)","v":false},{"$f":"IFERROR(IF(AND(VLOOKUP(LG12,'Feriados y días laborables'!$E$5:$F$11,2,0)=\"Si\",NOT(ISNUMBER(VLOOKUP(DATE($A$7,$A$9+1-1,LG11),Feriados,1,0)))),TRUE,FALSE),FALSE)","v":false},{"$f":"IFERROR(IF(AND(VLOOKUP(LH12,'Feriados y días laborables'!$E$5:$F$11,2,0)=\"Si\",NOT(ISNUMBER(VLOOKUP(DATE($A$7,$A$9+1-1,LH11),Feriados,1,0)))),TRUE,FALSE),FALSE)","v":false},{"$f":"IFERROR(IF(AND(VLOOKUP(LI12,'Feriados y días laborables'!$E$5:$F$11,2,0)=\"Si\",NOT(ISNUMBER(VLOOKUP(DATE($A$7,$A$9+1-1,LI11),Feriados,1,0)))),TRUE,FALSE),FALSE)","v":false},{"$f":"IFERROR(IF(AND(VLOOKUP(LJ12,'Feriados y días laborables'!$E$5:$F$11,2,0)=\"Si\",NOT(ISNUMBER(VLOOKUP(DATE($A$7,$A$9+1-1,LJ11),Feriados,1,0)))),TRUE,FALSE),FALSE)","v":false},{"$f":"IFERROR(IF(AND(VLOOKUP(LK12,'Feriados y días laborables'!$E$5:$F$11,2,0)=\"Si\",NOT(ISNUMBER(VLOOKUP(DATE($A$7,$A$9+1-1,LK11),Feriados,1,0)))),TRUE,FALSE),FALSE)","v":false},{"$f":"IFERROR(IF(AND(VLOOKUP(LL12,'Feriados y días laborables'!$E$5:$F$11,2,0)=\"Si\",NOT(ISNUMBER(VLOOKUP(DATE($A$7,$A$9+1-1,LL11),Feriados,1,0)))),TRUE,FALSE),FALSE)","v":false},{"$f":"IFERROR(IF(AND(VLOOKUP(LM12,'Feriados y días laborables'!$E$5:$F$11,2,0)=\"Si\",NOT(ISNUMBER(VLOOKUP(DATE($A$7,$A$9+1-1,LM11),Feriados,1,0)))),TRUE,FALSE),FALSE)","v":false},{"$f":"IFERROR(IF(AND(VLOOKUP(LN12,'Feriados y días laborables'!$E$5:$F$11,2,0)=\"Si\",NOT(ISNUMBER(VLOOKUP(DATE($A$7,$A$9+1-1,LN11),Feriados,1,0)))),TRUE,FALSE),FALSE)","v":false},{"$f":"IFERROR(IF(AND(VLOOKUP(LO12,'Feriados y días laborables'!$E$5:$F$11,2,0)=\"Si\",NOT(ISNUMBER(VLOOKUP(DATE($A$7,$A$9+1-1,LO11),Feriados,1,0)))),TRUE,FALSE),FALSE)","v":false},{"$f":"IFERROR(IF(AND(VLOOKUP(LP12,'Feriados y días laborables'!$E$5:$F$11,2,0)=\"Si\",NOT(ISNUMBER(VLOOKUP(DATE($A$7,$A$9+1-1,LP11),Feriados,1,0)))),TRUE,FALSE),FALSE)","v":false},{"$f":"IFERROR(IF(AND(VLOOKUP(LQ12,'Feriados y días laborables'!$E$5:$F$11,2,0)=\"Si\",NOT(ISNUMBER(VLOOKUP(DATE($A$7,$A$9+1-1,LQ11),Feriados,1,0)))),TRUE,FALSE),FALSE)","v":false},{"$f":"IFERROR(IF(AND(VLOOKUP(LR12,'Feriados y días laborables'!$E$5:$F$11,2,0)=\"Si\",NOT(ISNUMBER(VLOOKUP(DATE($A$7,$A$9+1-1,LR11),Feriados,1,0)))),TRUE,FALSE),FALSE)","v":false},{"$f":"IFERROR(IF(AND(VLOOKUP(LS12,'Feriados y días laborables'!$E$5:$F$11,2,0)=\"Si\",NOT(ISNUMBER(VLOOKUP(DATE($A$7,$A$9+1-1,LS11),Feriados,1,0)))),TRUE,FALSE),FALSE)","v":false},{"$f":"IFERROR(IF(AND(VLOOKUP(LT12,'Feriados y días laborables'!$E$5:$F$11,2,0)=\"Si\",NOT(ISNUMBER(VLOOKUP(DATE($A$7,$A$9+1-1,LT11),Feriados,1,0)))),TRUE,FALSE),FALSE)","v":false},{"$f":"IFERROR(IF(AND(VLOOKUP(LU12,'Feriados y días laborables'!$E$5:$F$11,2,0)=\"Si\",NOT(ISNUMBER(VLOOKUP(DATE($A$7,$A$9+1-1,LU11),Feriados,1,0)))),TRUE,FALSE),FALSE)","v":false},{"$f":"IFERROR(IF(AND(VLOOKUP(LV12,'Feriados y días laborables'!$E$5:$F$11,2,0)=\"Si\",NOT(ISNUMBER(VLOOKUP(DATE($A$7,$A$9+1-1,LV11),Feriados,1,0)))),TRUE,FALSE),FALSE)","v":false},{"$f":"IFERROR(IF(AND(VLOOKUP(LW12,'Feriados y días laborables'!$E$5:$F$11,2,0)=\"Si\",NOT(ISNUMBER(VLOOKUP(DATE($A$7,$A$9+1-1,LW11),Feriados,1,0)))),TRUE,FALSE),FALSE)","v":false},{"$f":"IFERROR(IF(AND(VLOOKUP(LX12,'Feriados y días laborables'!$E$5:$F$11,2,0)=\"Si\",NOT(ISNUMBER(VLOOKUP(DATE($A$7,$A$9+1-1,LX11),Feriados,1,0)))),TRUE,FALSE),FALSE)","v":false},{"$f":"IFERROR(IF(AND(VLOOKUP(LY12,'Feriados y días laborables'!$E$5:$F$11,2,0)=\"Si\",NOT(ISNUMBER(VLOOKUP(DATE($A$7,$A$9+1-1,LY11),Feriados,1,0)))),TRUE,FALSE),FALSE)","v":false},{"$f":"IFERROR(IF(AND(VLOOKUP(LZ12,'Feriados y días laborables'!$E$5:$F$11,2,0)=\"Si\",NOT(ISNUMBER(VLOOKUP(DATE($A$7,$A$9+1-1,LZ11),Feriados,1,0)))),TRUE,FALSE),FALSE)","v":false},{"$f":"IFERROR(IF(AND(VLOOKUP(MA12,'Feriados y días laborables'!$E$5:$F$11,2,0)=\"Si\",NOT(ISNUMBER(VLOOKUP(DATE($A$7,$A$9+1-1,MA11),Feriados,1,0)))),TRUE,FALSE),FALSE)","v":false},{"$f":"IFERROR(IF(AND(VLOOKUP(MB12,'Feriados y días laborables'!$E$5:$F$11,2,0)=\"Si\",NOT(ISNUMBER(VLOOKUP(DATE($A$7,$A$9+1-1,MB11),Feriados,1,0)))),TRUE,FALSE),FALSE)","v":false},{"$f":"IFERROR(IF(AND(VLOOKUP(MC12,'Feriados y días laborables'!$E$5:$F$11,2,0)=\"Si\",NOT(ISNUMBER(VLOOKUP(DATE($A$7,$A$9+1-1,MC11),Feriados,1,0)))),TRUE,FALSE),FALSE)","v":false},{"$f":"IFERROR(IF(AND(VLOOKUP(MD12,'Feriados y días laborables'!$E$5:$F$11,2,0)=\"Si\",NOT(ISNUMBER(VLOOKUP(DATE($A$7,$A$9+1-1,MD11),Feriados,1,0)))),TRUE,FALSE),FALSE)","v":false},{"$f":"IFERROR(IF(AND(VLOOKUP(ME12,'Feriados y días laborables'!$E$5:$F$11,2,0)=\"Si\",NOT(ISNUMBER(VLOOKUP(DATE($A$7,$A$9+1-1,ME11),Feriados,1,0)))),TRUE,FALSE),FALSE)","v":false},{"$f":"IFERROR(IF(AND(VLOOKUP(MF12,'Feriados y días laborables'!$E$5:$F$11,2,0)=\"Si\",NOT(ISNUMBER(VLOOKUP(DATE($A$7,$A$9+1-1,MF11),Feriados,1,0)))),TRUE,FALSE),FALSE)","v":false},{"$f":"IFERROR(IF(AND(VLOOKUP(MG12,'Feriados y días laborables'!$E$5:$F$11,2,0)=\"Si\",NOT(ISNUMBER(VLOOKUP(DATE($A$7,$A$9+1-1,MG11),Feriados,1,0)))),TRUE,FALSE),FALSE)","v":false},{"$f":"IFERROR(IF(AND(VLOOKUP(MH12,'Feriados y días laborables'!$E$5:$F$11,2,0)=\"Si\",NOT(ISNUMBER(VLOOKUP(DATE($A$7,$A$9+1-1,MH11),Feriados,1,0)))),TRUE,FALSE),FALSE)","v":false},{"$f":"IFERROR(IF(AND(VLOOKUP(MI12,'Feriados y días laborables'!$E$5:$F$11,2,0)=\"Si\",NOT(ISNUMBER(VLOOKUP(DATE($A$7,$A$9+1-1,MI11),Feriados,1,0)))),TRUE,FALSE),FALSE)","v":false},{"$f":"IFERROR(IF(AND(VLOOKUP(MJ12,'Feriados y días laborables'!$E$5:$F$11,2,0)=\"Si\",NOT(ISNUMBER(VLOOKUP(DATE($A$7,$A$9+1-1,MJ11),Feriados,1,0)))),TRUE,FALSE),FALSE)","v":false},{"$f":"IFERROR(IF(AND(VLOOKUP(MK12,'Feriados y días laborables'!$E$5:$F$11,2,0)=\"Si\",NOT(ISNUMBER(VLOOKUP(DATE($A$7,$A$9+1-1,MK11),Feriados,1,0)))),TRUE,FALSE),FALSE)","v":false},{"$f":"IFERROR(IF(AND(VLOOKUP(ML12,'Feriados y días laborables'!$E$5:$F$11,2,0)=\"Si\",NOT(ISNUMBER(VLOOKUP(DATE($A$7,$A$9+1-1,ML11),Feriados,1,0)))),TRUE,FALSE),FALSE)","v":false},{"$f":"IFERROR(IF(AND(VLOOKUP(MM12,'Feriados y días laborables'!$E$5:$F$11,2,0)=\"Si\",NOT(ISNUMBER(VLOOKUP(DATE($A$7,$A$9+1-1,MM11),Feriados,1,0)))),TRUE,FALSE),FALSE)","v":false},{"$f":"IFERROR(IF(AND(VLOOKUP(MN12,'Feriados y días laborables'!$E$5:$F$11,2,0)=\"Si\",NOT(ISNUMBER(VLOOKUP(DATE($A$7,$A$9+1-1,MN11),Feriados,1,0)))),TRUE,FALSE),FALSE)","v":false},{"$f":"IFERROR(IF(AND(VLOOKUP(MO12,'Feriados y días laborables'!$E$5:$F$11,2,0)=\"Si\",NOT(ISNUMBER(VLOOKUP(DATE($A$7,$A$9+1-1,MO11),Feriados,1,0)))),TRUE,FALSE),FALSE)","v":false},{"$f":"IFERROR(IF(AND(VLOOKUP(MP12,'Feriados y días laborables'!$E$5:$F$11,2,0)=\"Si\",NOT(ISNUMBER(VLOOKUP(DATE($A$7,$A$9+1-1,MP11),Feriados,1,0)))),TRUE,FALSE),FALSE)","v":false},{"$f":"IFERROR(IF(AND(VLOOKUP(MQ12,'Feriados y días laborables'!$E$5:$F$11,2,0)=\"Si\",NOT(ISNUMBER(VLOOKUP(DATE($A$7,$A$9+1-1,MQ11),Feriados,1,0)))),TRUE,FALSE),FALSE)","v":false},{"$f":"IFERROR(IF(AND(VLOOKUP(MR12,'Feriados y días laborables'!$E$5:$F$11,2,0)=\"Si\",NOT(ISNUMBER(VLOOKUP(DATE($A$7,$A$9+1-1,MR11),Feriados,1,0)))),TRUE,FALSE),FALSE)","v":false},{"$f":"IFERROR(IF(AND(VLOOKUP(MS12,'Feriados y días laborables'!$E$5:$F$11,2,0)=\"Si\",NOT(ISNUMBER(VLOOKUP(DATE($A$7,$A$9+1-1,MS11),Feriados,1,0)))),TRUE,FALSE),FALSE)","v":false},{"$f":"IFERROR(IF(AND(VLOOKUP(MT12,'Feriados y días laborables'!$E$5:$F$11,2,0)=\"Si\",NOT(ISNUMBER(VLOOKUP(DATE($A$7,$A$9+1-1,MT11),Feriados,1,0)))),TRUE,FALSE),FALSE)","v":false},{"$f":"IFERROR(IF(AND(VLOOKUP(MU12,'Feriados y días laborables'!$E$5:$F$11,2,0)=\"Si\",NOT(ISNUMBER(VLOOKUP(DATE($A$7,$A$9+1-1,MU11),Feriados,1,0)))),TRUE,FALSE),FALSE)","v":false},{"$f":"IFERROR(IF(AND(VLOOKUP(MV12,'Feriados y días laborables'!$E$5:$F$11,2,0)=\"Si\",NOT(ISNUMBER(VLOOKUP(DATE($A$7,$A$9+1-1,MV11),Feriados,1,0)))),TRUE,FALSE),FALSE)","v":false},{"$f":"IFERROR(IF(AND(VLOOKUP(MW12,'Feriados y días laborables'!$E$5:$F$11,2,0)=\"Si\",NOT(ISNUMBER(VLOOKUP(DATE($A$7,$A$9+1-1,MW11),Feriados,1,0)))),TRUE,FALSE),FALSE)","v":false},{"$f":"IFERROR(IF(AND(VLOOKUP(MX12,'Feriados y días laborables'!$E$5:$F$11,2,0)=\"Si\",NOT(ISNUMBER(VLOOKUP(DATE($A$7,$A$9+1-1,MX11),Feriados,1,0)))),TRUE,FALSE),FALSE)","v":false},{"$f":"IFERROR(IF(AND(VLOOKUP(MY12,'Feriados y días laborables'!$E$5:$F$11,2,0)=\"Si\",NOT(ISNUMBER(VLOOKUP(DATE($A$7,$A$9+1-1,MY11),Feriados,1,0)))),TRUE,FALSE),FALSE)","v":false},{"$f":"IFERROR(IF(AND(VLOOKUP(MZ12,'Feriados y días laborables'!$E$5:$F$11,2,0)=\"Si\",NOT(ISNUMBER(VLOOKUP(DATE($A$7,$A$9+1-1,MZ11),Feriados,1,0)))),TRUE,FALSE),FALSE)","v":false},{"$f":"IFERROR(IF(AND(VLOOKUP(NA12,'Feriados y días laborables'!$E$5:$F$11,2,0)=\"Si\",NOT(ISNUMBER(VLOOKUP(DATE($A$7,$A$9+1-1,NA11),Feriados,1,0)))),TRUE,FALSE),FALSE)","v":false},{"$f":"IFERROR(IF(AND(VLOOKUP(NB12,'Feriados y días laborables'!$E$5:$F$11,2,0)=\"Si\",NOT(ISNUMBER(VLOOKUP(DATE($A$7,$A$9+1-1,NB11),Feriados,1,0)))),TRUE,FALSE),FALSE)","v":false},{"$f":"IFERROR(IF(AND(VLOOKUP(NC12,'Feriados y días laborables'!$E$5:$F$11,2,0)=\"Si\",NOT(ISNUMBER(VLOOKUP(DATE($A$7,$A$9+1-1,NC11),Feriados,1,0)))),TRUE,FALSE),FALSE)","v":false},{"$f":"IFERROR(IF(AND(VLOOKUP(ND12,'Feriados y días laborables'!$E$5:$F$11,2,0)=\"Si\",NOT(ISNUMBER(VLOOKUP(DATE($A$7,$A$9+1-1,ND11),Feriados,1,0)))),TRUE,FALSE),FALSE)","v":false},{"$f":"IFERROR(IF(AND(VLOOKUP(NE12,'Feriados y días laborables'!$E$5:$F$11,2,0)=\"Si\",NOT(ISNUMBER(VLOOKUP(DATE($A$7,$A$9+1-1,NE11),Feriados,1,0)))),TRUE,FALSE),FALSE)","v":false},{"$f":"IFERROR(IF(AND(VLOOKUP(NF12,'Feriados y días laborables'!$E$5:$F$11,2,0)=\"Si\",NOT(ISNUMBER(VLOOKUP(DATE($A$7,$A$9+1-1,NF11),Feriados,1,0)))),TRUE,FALSE),FALSE)","v":false},{"$f":"IFERROR(IF(AND(VLOOKUP(NG12,'Feriados y días laborables'!$E$5:$F$11,2,0)=\"Si\",NOT(ISNUMBER(VLOOKUP(DATE($A$7,$A$9+1-1,NG11),Feriados,1,0)))),TRUE,FALSE),FALSE)","v":false},{"$f":"IFERROR(IF(AND(VLOOKUP(NH12,'Feriados y días laborables'!$E$5:$F$11,2,0)=\"Si\",NOT(ISNUMBER(VLOOKUP(DATE($A$7,$A$9+1-1,NH11),Feriados,1,0)))),TRUE,FALSE),FALSE)","v":false},{"$f":"IFERROR(IF(AND(VLOOKUP(NI12,'Feriados y días laborables'!$E$5:$F$11,2,0)=\"Si\",NOT(ISNUMBER(VLOOKUP(DATE($A$7,$A$9+1-1,NI11),Feriados,1,0)))),TRUE,FALSE),FALSE)","v":false},null,null,null,null,"Cálculos automáticos"]
[null,{"$f":"IF(AND((COLUMN()-1)>31*($A$9-1),MONTH(DATE($A$7+INT(($A$9+1)/12),INT((COLUMN()-1)/31.001)+1,ROUNDUP(MOD(COLUMN()-1,31.001),0)))=ROUNDUP(MOD(1+$A$9-1,12.01),0)),ROUNDUP(MOD(COLUMN()-1,31.001),0),\"\")","v":"1900-01-01"},{"$f":"IF(AND((COLUMN()-1)>31*($A$9-1),MONTH(DATE($A$7+INT(($A$9+1)/12),INT((COLUMN()-1)/31.001)+1,ROUNDUP(MOD(COLUMN()-1,31.001),0)))=ROUNDUP(MOD(1+$A$9-1,12.01),0)),ROUNDUP(MOD(COLUMN()-1,31.001),0),\"\")","v":"1900-01-02"},"1900-01-03","1900-01-04","1900-01-05","1900-01-06","1900-01-07","1900-01-08","1900-01-09","1900-01-10","1900-01-11","1900-01-12","1900-01-13","1900-01-14","1900-01-15","1900-01-16","1900-01-17","1900-01-18","1900-01-19","1900-01-20","1900-01-21","1900-01-22","1900-01-23","1900-01-24","1900-01-25","1900-01-26","1900-01-27","1900-01-28","1900-01-29","1900-01-30","1900-01-31","","","","","","","","","","","","","","","","","","","","","","","","","","","","","","","","","","",{"$f":"IF(AND((COLUMN()-1)>31*($A$9-1),MONTH(DATE($A$7+INT(($A$9+1)/12),INT((COLUMN()-1)/31.001)+1,ROUNDUP(MOD(COLUMN()-1,31.001),0)))=ROUNDUP(MOD(1+$A$9-1,12.01),0)),ROUNDUP(MOD(COLUMN()-1,31.001),0),\"\")","v":""},"","","","","","","","","","","","","","","","","","","","","","","","","","","","","","","","","","","","","","","","","","","","","","","","","","","","","","","","","","","","","","","",{"$f":"IF(AND((COLUMN()-1)>31*($A$9-1),MONTH(DATE($A$7+INT(($A$9+1)/12),INT((COLUMN()-1)/31.001)+1,ROUNDUP(MOD(COLUMN()-1,31.001),0)))=ROUNDUP(MOD(1+$A$9-1,12.01),0)),ROUNDUP(MOD(COLUMN()-1,31.001),0),\"\")","v":""},"","","","","","","","","","","","","","","","","","","","","","","","","","","","","","","","","","","","","","","","","","","","","","","","","","","","","","","","","","","","","","","",{"$f":"IF(AND((COLUMN()-1)>31*($A$9-1),MONTH(DATE($A$7+INT(($A$9+1)/12),INT((COLUMN()-1)/31.001)+1,ROUNDUP(MOD(COLUMN()-1,31.001),0)))=ROUNDUP(MOD(1+$A$9-1,12.01),0)),ROUNDUP(MOD(COLUMN()-1,31.001),0),\"\")","v":""},"","","","","","","","","","","","","","","","","","","","","","","","","","","","","","","","","","","","","","","","","","","","","","","","","","","","","","","","","","","","","","","",{"$f":"IF(AND((COLUMN()-1)>31*($A$9-1),MONTH(DATE($A$7+INT(($A$9+1)/12),INT((COLUMN()-1)/31.001)+1,ROUNDUP(MOD(COLUMN()-1,31.001),0)))=ROUNDUP(MOD(1+$A$9-1,12.01),0)),ROUNDUP(MOD(COLUMN()-1,31.001),0),\"\")","v":""},"","","","","","","","","","","","","","","","","","","","","","","","","","","","","","","","","","","","","","","","","","","","","","","","","","","","","","","","","","","","","","","",{"$f":"IF(AND((COLUMN()-1)>31*($A$9-1),MONTH(DATE($A$7+INT(($A$9+1)/12),INT((COLUMN()-1)/31.001)+1,ROUNDUP(MOD(COLUMN()-1,31.001),0)))=ROUNDUP(MOD(1+$A$9-1,12.01),0)),ROUNDUP(MOD(COLUMN()-1,31.001),0),\"\")","v":""},"","","","","","","","","","","","","","","","","","","","","","","","","","","","","","","","","","","","","","","","","","","","","","","","","","",null,"Días por año","Días acumulados de años previos",null,"Días tomados en el mes","Días tomados en el año","Días pendientes",null,"Razón de salida"]
["Nombre",{"$f":"IF(B$11=\"\",\"\",VLOOKUP(WEEKDAY(DATE($A$7,$A$9+1-1,B11),2),Auxiliar!$D$1:$E$7,2,0))","v":"Vie"},{"$f":"IF(C$11=\"\",\"\",VLOOKUP(WEEKDAY(DATE($A$7,$A$9+1-1,C11),2),Auxiliar!$D$1:$E$7,2,0))","v":"Sab"},{"$f":"IF(D$11=\"\",\"\",VLOOKUP(WEEKDAY(DATE($A$7,$A$9+1-1,D11),2),Auxiliar!$D$1:$E$7,2,0))","v":"Dom"},{"$f":"IF(E$11=\"\",\"\",VLOOKUP(WEEKDAY(DATE($A$7,$A$9+1-1,E11),2),Auxiliar!$D$1:$E$7,2,0))","v":"Lun"},{"$f":"IF(F$11=\"\",\"\",VLOOKUP(WEEKDAY(DATE($A$7,$A$9+1-1,F11),2),Auxiliar!$D$1:$E$7,2,0))","v":"Mar"},{"$f":"IF(G$11=\"\",\"\",VLOOKUP(WEEKDAY(DATE($A$7,$A$9+1-1,G11),2),Auxiliar!$D$1:$E$7,2,0))","v":"Mie"},{"$f":"IF(H$11=\"\",\"\",VLOOKUP(WEEKDAY(DATE($A$7,$A$9+1-1,H11),2),Auxiliar!$D$1:$E$7,2,0))","v":"Jue"},{"$f":"IF(I$11=\"\",\"\",VLOOKUP(WEEKDAY(DATE($A$7,$A$9+1-1,I11),2),Auxiliar!$D$1:$E$7,2,0))","v":"Vie"},{"$f":"IF(J$11=\"\",\"\",VLOOKUP(WEEKDAY(DATE($A$7,$A$9+1-1,J11),2),Auxiliar!$D$1:$E$7,2,0))","v":"Sab"},{"$f":"IF(K$11=\"\",\"\",VLOOKUP(WEEKDAY(DATE($A$7,$A$9+1-1,K11),2),Auxiliar!$D$1:$E$7,2,0))","v":"Dom"},{"$f":"IF(L$11=\"\",\"\",VLOOKUP(WEEKDAY(DATE($A$7,$A$9+1-1,L11),2),Auxiliar!$D$1:$E$7,2,0))","v":"Lun"},{"$f":"IF(M$11=\"\",\"\",VLOOKUP(WEEKDAY(DATE($A$7,$A$9+1-1,M11),2),Auxiliar!$D$1:$E$7,2,0))","v":"Mar"},{"$f":"IF(N$11=\"\",\"\",VLOOKUP(WEEKDAY(DATE($A$7,$A$9+1-1,N11),2),Auxiliar!$D$1:$E$7,2,0))","v":"Mie"},{"$f":"IF(O$11=\"\",\"\",VLOOKUP(WEEKDAY(DATE($A$7,$A$9+1-1,O11),2),Auxiliar!$D$1:$E$7,2,0))","v":"Jue"},{"$f":"IF(P$11=\"\",\"\",VLOOKUP(WEEKDAY(DATE($A$7,$A$9+1-1,P11),2),Auxiliar!$D$1:$E$7,2,0))","v":"Vie"},{"$f":"IF(Q$11=\"\",\"\",VLOOKUP(WEEKDAY(DATE($A$7,$A$9+1-1,Q11),2),Auxiliar!$D$1:$E$7,2,0))","v":"Sab"},{"$f":"IF(R$11=\"\",\"\",VLOOKUP(WEEKDAY(DATE($A$7,$A$9+1-1,R11),2),Auxiliar!$D$1:$E$7,2,0))","v":"Dom"},{"$f":"IF(S$11=\"\",\"\",VLOOKUP(WEEKDAY(DATE($A$7,$A$9+1-1,S11),2),Auxiliar!$D$1:$E$7,2,0))","v":"Lun"},{"$f":"IF(T$11=\"\",\"\",VLOOKUP(WEEKDAY(DATE($A$7,$A$9+1-1,T11),2),Auxiliar!$D$1:$E$7,2,0))","v":"Mar"},{"$f":"IF(U$11=\"\",\"\",VLOOKUP(WEEKDAY(DATE($A$7,$A$9+1-1,U11),2),Auxiliar!$D$1:$E$7,2,0))","v":"Mie"},{"$f":"IF(V$11=\"\",\"\",VLOOKUP(WEEKDAY(DATE($A$7,$A$9+1-1,V11),2),Auxiliar!$D$1:$E$7,2,0))","v":"Jue"},{"$f":"IF(W$11=\"\",\"\",VLOOKUP(WEEKDAY(DATE($A$7,$A$9+1-1,W11),2),Auxiliar!$D$1:$E$7,2,0))","v":"Vie"},{"$f":"IF(X$11=\"\",\"\",VLOOKUP(WEEKDAY(DATE($A$7,$A$9+1-1,X11),2),Auxiliar!$D$1:$E$7,2,0))","v":"Sab"},{"$f":"IF(Y$11=\"\",\"\",VLOOKUP(WEEKDAY(DATE($A$7,$A$9+1-1,Y11),2),Auxiliar!$D$1:$E$7,2,0))","v":"Dom"},{"$f":"IF(Z$11=\"\",\"\",VLOOKUP(WEEKDAY(DATE($A$7,$A$9+1-1,Z11),2),Auxiliar!$D$1:$E$7,2,0))","v":"Lun"},{"$f":"IF(AA$11=\"\",\"\",VLOOKUP(WEEKDAY(DATE($A$7,$A$9+1-1,AA11),2),Auxiliar!$D$1:$E$7,2,0))","v":"Mar"},{"$f":"IF(AB$11=\"\",\"\",VLOOKUP(WEEKDAY(DATE($A$7,$A$9+1-1,AB11),2),Auxiliar!$D$1:$E$7,2,0))","v":"Mie"},{"$f":"IF(AC$11=\"\",\"\",VLOOKUP(WEEKDAY(DATE($A$7,$A$9+1-1,AC11),2),Auxiliar!$D$1:$E$7,2,0))","v":"Jue"},{"$f":"IF(AD$11=\"\",\"\",VLOOKUP(WEEKDAY(DATE($A$7,$A$9+1-1,AD11),2),Auxiliar!$D$1:$E$7,2,0))","v":"Vie"},{"$f":"IF(AE$11=\"\",\"\",VLOOKUP(WEEKDAY(DATE($A$7,$A$9+1-1,AE11),2),Auxiliar!$D$1:$E$7,2,0))","v":"Sab"},{"$f":"IF(AF$11=\"\",\"\",VLOOKUP(WEEKDAY(DATE($A$7,$A$9+1-1,AF11),2),Auxiliar!$D$1:$E$7,2,0))","v":"Dom"},{"$f":"IF(AG$11=\"\",\"\",VLOOKUP(WEEKDAY(DATE($A$7,$A$9+1-1,AG11),2),Auxiliar!$D$1:$E$7,2,0))","v":""},{"$f":"IF(AH$11=\"\",\"\",VLOOKUP(WEEKDAY(DATE($A$7,$A$9+1-1,AH11),2),Auxiliar!$D$1:$E$7,2,0))","v":""},{"$f":"IF(AI$11=\"\",\"\",VLOOKUP(WEEKDAY(DATE($A$7,$A$9+1-1,AI11),2),Auxiliar!$D$1:$E$7,2,0))","v":""},{"$f":"IF(AJ$11=\"\",\"\",VLOOKUP(WEEKDAY(DATE($A$7,$A$9+1-1,AJ11),2),Auxiliar!$D$1:$E$7,2,0))","v":""},{"$f":"IF(AK$11=\"\",\"\",VLOOKUP(WEEKDAY(DATE($A$7,$A$9+1-1,AK11),2),Auxiliar!$D$1:$E$7,2,0))","v":""},{"$f":"IF(AL$11=\"\",\"\",VLOOKUP(WEEKDAY(DATE($A$7,$A$9+1-1,AL11),2),Auxiliar!$D$1:$E$7,2,0))","v":""},{"$f":"IF(AM$11=\"\",\"\",VLOOKUP(WEEKDAY(DATE($A$7,$A$9+1-1,AM11),2),Auxiliar!$D$1:$E$7,2,0))","v":""},{"$f":"IF(AN$11=\"\",\"\",VLOOKUP(WEEKDAY(DATE($A$7,$A$9+1-1,AN11),2),Auxiliar!$D$1:$E$7,2,0))","v":""},{"$f":"IF(AO$11=\"\",\"\",VLOOKUP(WEEKDAY(DATE($A$7,$A$9+1-1,AO11),2),Auxiliar!$D$1:$E$7,2,0))","v":""},{"$f":"IF(AP$11=\"\",\"\",VLOOKUP(WEEKDAY(DATE($A$7,$A$9+1-1,AP11),2),Auxiliar!$D$1:$E$7,2,0))","v":""},{"$f":"IF(AQ$11=\"\",\"\",VLOOKUP(WEEKDAY(DATE($A$7,$A$9+1-1,AQ11),2),Auxiliar!$D$1:$E$7,2,0))","v":""},{"$f":"IF(AR$11=\"\",\"\",VLOOKUP(WEEKDAY(DATE($A$7,$A$9+1-1,AR11),2),Auxiliar!$D$1:$E$7,2,0))","v":""},{"$f":"IF(AS$11=\"\",\"\",VLOOKUP(WEEKDAY(DATE($A$7,$A$9+1-1,AS11),2),Auxiliar!$D$1:$E$7,2,0))","v":""},{"$f":"IF(AT$11=\"\",\"\",VLOOKUP(WEEKDAY(DATE($A$7,$A$9+1-1,AT11),2),Auxiliar!$D$1:$E$7,2,0))","v":""},{"$f":"IF(AU$11=\"\",\"\",VLOOKUP(WEEKDAY(DATE($A$7,$A$9+1-1,AU11),2),Auxiliar!$D$1:$E$7,2,0))","v":""},{"$f":"IF(AV$11=\"\",\"\",VLOOKUP(WEEKDAY(DATE($A$7,$A$9+1-1,AV11),2),Auxiliar!$D$1:$E$7,2,0))","v":""},{"$f":"IF(AW$11=\"\",\"\",VLOOKUP(WEEKDAY(DATE($A$7,$A$9+1-1,AW11),2),Auxiliar!$D$1:$E$7,2,0))","v":""},{"$f":"IF(AX$11=\"\",\"\",VLOOKUP(WEEKDAY(DATE($A$7,$A$9+1-1,AX11),2),Auxiliar!$D$1:$E$7,2,0))","v":""},{"$f":"IF(AY$11=\"\",\"\",VLOOKUP(WEEKDAY(DATE($A$7,$A$9+1-1,AY11),2),Auxiliar!$D$1:$E$7,2,0))","v":""},{"$f":"IF(AZ$11=\"\",\"\",VLOOKUP(WEEKDAY(DATE($A$7,$A$9+1-1,AZ11),2),Auxiliar!$D$1:$E$7,2,0))","v":""},{"$f":"IF(BA$11=\"\",\"\",VLOOKUP(WEEKDAY(DATE($A$7,$A$9+1-1,BA11),2),Auxiliar!$D$1:$E$7,2,0))","v":""},{"$f":"IF(BB$11=\"\",\"\",VLOOKUP(WEEKDAY(DATE($A$7,$A$9+1-1,BB11),2),Auxiliar!$D$1:$E$7,2,0))","v":""},{"$f":"IF(BC$11=\"\",\"\",VLOOKUP(WEEKDAY(DATE($A$7,$A$9+1-1,BC11),2),Auxiliar!$D$1:$E$7,2,0))","v":""},{"$f":"IF(BD$11=\"\",\"\",VLOOKUP(WEEKDAY(DATE($A$7,$A$9+1-1,BD11),2),Auxiliar!$D$1:$E$7,2,0))","v":""},{"$f":"IF(BE$11=\"\",\"\",VLOOKUP(WEEKDAY(DATE($A$7,$A$9+1-1,BE11),2),Auxiliar!$D$1:$E$7,2,0))","v":""},{"$f":"IF(BF$11=\"\",\"\",VLOOKUP(WEEKDAY(DATE($A$7,$A$9+1-1,BF11),2),Auxiliar!$D$1:$E$7,2,0))","v":""},{"$f":"IF(BG$11=\"\",\"\",VLOOKUP(WEEKDAY(DATE($A$7,$A$9+1-1,BG11),2),Auxiliar!$D$1:$E$7,2,0))","v":""},{"$f":"IF(BH$11=\"\",\"\",VLOOKUP(WEEKDAY(DATE($A$7,$A$9+1-1,BH11),2),Auxiliar!$D$1:$E$7,2,0))","v":""},{"$f":"IF(BI$11=\"\",\"\",VLOOKUP(WEEKDAY(DATE($A$7,$A$9+1-1,BI11),2),Auxiliar!$D$1:$E$7,2,0))","v":""},{"$f":"IF(BJ$11=\"\",\"\",VLOOKUP(WEEKDAY(DATE($A$7,$A$9+1-1,BJ11),2),Auxiliar!$D$1:$E$7,2,0))","v":""},{"$f":"IF(BK$11=\"\",\"\",VLOOKUP(WEEKDAY(DATE($A$7,$A$9+1-1,BK11),2),Auxiliar!$D$1:$E$7,2,0))","v":""},{"$f":"IF(BL$11=\"\",\"\",VLOOKUP(WEEKDAY(DATE($A$7,$A$9+1-1,BL11),2),Auxiliar!$D$1:$E$7,2,0))","v":""},{"$f":"IF(BM$11=\"\",\"\",VLOOKUP(WEEKDAY(DATE($A$7,$A$9+1-1,BM11),2),Auxiliar!$D$1:$E$7,2,0))","v":""},{"$f":"IF(BN$11=\"\",\"\",VLOOKUP(WEEKDAY(DATE($A$7,$A$9+1-1,BN11),2),Auxiliar!$D$1:$E$7,2,0))","v":""},{"$f":"IF(BO$11=\"\",\"\",VLOOKUP(WEEKDAY(DATE($A$7,$A$9+1-1,BO11),2),Auxiliar!$D$1:$E$7,2,0))","v":""},{"$f":"IF(BP$11=\"\",\"\",VLOOKUP(WEEKDAY(DATE($A$7,$A$9+1-1,BP11),2),Auxiliar!$D$1:$E$7,2,0))","v":""},{"$f":"IF(BQ$11=\"\",\"\",VLOOKUP(WEEKDAY(DATE($A$7,$A$9+1-1,BQ11),2),Auxiliar!$D$1:$E$7,2,0))","v":""},{"$f":"IF(BR$11=\"\",\"\",VLOOKUP(WEEKDAY(DATE($A$7,$A$9+1-1,BR11),2),Auxiliar!$D$1:$E$7,2,0))","v":""},{"$f":"IF(BS$11=\"\",\"\",VLOOKUP(WEEKDAY(DATE($A$7,$A$9+1-1,BS11),2),Auxiliar!$D$1:$E$7,2,0))","v":""},{"$f":"IF(BT$11=\"\",\"\",VLOOKUP(WEEKDAY(DATE($A$7,$A$9+1-1,BT11),2),Auxiliar!$D$1:$E$7,2,0))","v":""},{"$f":"IF(BU$11=\"\",\"\",VLOOKUP(WEEKDAY(DATE($A$7,$A$9+1-1,BU11),2),Auxiliar!$D$1:$E$7,2,0))","v":""},{"$f":"IF(BV$11=\"\",\"\",VLOOKUP(WEEKDAY(DATE($A$7,$A$9+1-1,BV11),2),Auxiliar!$D$1:$E$7,2,0))","v":""},{"$f":"IF(BW$11=\"\",\"\",VLOOKUP(WEEKDAY(DATE($A$7,$A$9+1-1,BW11),2),Auxiliar!$D$1:$E$7,2,0))","v":""},{"$f":"IF(BX$11=\"\",\"\",VLOOKUP(WEEKDAY(DATE($A$7,$A$9+1-1,BX11),2),Auxiliar!$D$1:$E$7,2,0))","v":""},{"$f":"IF(BY$11=\"\",\"\",VLOOKUP(WEEKDAY(DATE($A$7,$A$9+1-1,BY11),2),Auxiliar!$D$1:$E$7,2,0))","v":""},{"$f":"IF(BZ$11=\"\",\"\",VLOOKUP(WEEKDAY(DATE($A$7,$A$9+1-1,BZ11),2),Auxiliar!$D$1:$E$7,2,0))","v":""},{"$f":"IF(CA$11=\"\",\"\",VLOOKUP(WEEKDAY(DATE($A$7,$A$9+1-1,CA11),2),Auxiliar!$D$1:$E$7,2,0))","v":""},{"$f":"IF(CB$11=\"\",\"\",VLOOKUP(WEEKDAY(DATE($A$7,$A$9+1-1,CB11),2),Auxiliar!$D$1:$E$7,2,0))","v":""},{"$f":"IF(CC$11=\"\",\"\",VLOOKUP(WEEKDAY(DATE($A$7,$A$9+1-1,CC11),2),Auxiliar!$D$1:$E$7,2,0))","v":""},{"$f":"IF(CD$11=\"\",\"\",VLOOKUP(WEEKDAY(DATE($A$7,$A$9+1-1,CD11),2),Auxiliar!$D$1:$E$7,2,0))","v":""},{"$f":"IF(CE$11=\"\",\"\",VLOOKUP(WEEKDAY(DATE($A$7,$A$9+1-1,CE11),2),Auxiliar!$D$1:$E$7,2,0))","v":""},{"$f":"IF(CF$11=\"\",\"\",VLOOKUP(WEEKDAY(DATE($A$7,$A$9+1-1,CF11),2),Auxiliar!$D$1:$E$7,2,0))","v":""},{"$f":"IF(CG$11=\"\",\"\",VLOOKUP(WEEKDAY(DATE($A$7,$A$9+1-1,CG11),2),Auxiliar!$D$1:$E$7,2,0))","v":""},{"$f":"IF(CH$11=\"\",\"\",VLOOKUP(WEEKDAY(DATE($A$7,$A$9+1-1,CH11),2),Auxiliar!$D$1:$E$7,2,0))","v":""},{"$f":"IF(CI$11=\"\",\"\",VLOOKUP(WEEKDAY(DATE($A$7,$A$9+1-1,CI11),2),Auxiliar!$D$1:$E$7,2,0))","v":""},{"$f":"IF(CJ$11=\"\",\"\",VLOOKUP(WEEKDAY(DATE($A$7,$A$9+1-1,CJ11),2),Auxiliar!$D$1:$E$7,2,0))","v":""},{"$f":"IF(CK$11=\"\",\"\",VLOOKUP(WEEKDAY(DATE($A$7,$A$9+1-1,CK11),2),Auxiliar!$D$1:$E$7,2,0))","v":""},{"$f":"IF(CL$11=\"\",\"\",VLOOKUP(WEEKDAY(DATE($A$7,$A$9+1-1,CL11),2),Auxiliar!$D$1:$E$7,2,0))","v":""},{"$f":"IF(CM$11=\"\",\"\",VLOOKUP(WEEKDAY(DATE($A$7,$A$9+1-1,CM11),2),Auxiliar!$D$1:$E$7,2,0))","v":""},{"$f":"IF(CN$11=\"\",\"\",VLOOKUP(WEEKDAY(DATE($A$7,$A$9+1-1,CN11),2),Auxiliar!$D$1:$E$7,2,0))","v":""},{"$f":"IF(CO$11=\"\",\"\",VLOOKUP(WEEKDAY(DATE($A$7,$A$9+1-1,CO11),2),Auxiliar!$D$1:$E$7,2,0))","v":""},{"$f":"IF(CP$11=\"\",\"\",VLOOKUP(WEEKDAY(DATE($A$7,$A$9+1-1,CP11),2),Auxiliar!$D$1:$E$7,2,0))","v":""},{"$f":"IF(CQ$11=\"\",\"\",VLOOKUP(WEEKDAY(DATE($A$7,$A$9+1-1,CQ11),2),Auxiliar!$D$1:$E$7,2,0))","v":""},{"$f":"IF(CR$11=\"\",\"\",VLOOKUP(WEEKDAY(DATE($A$7,$A$9+1-1,CR11),2),Auxiliar!$D$1:$E$7,2,0))","v":""},{"$f":"IF(CS$11=\"\",\"\",VLOOKUP(WEEKDAY(DATE($A$7,$A$9+1-1,CS11),2),Auxiliar!$D$1:$E$7,2,0))","v":""},{"$f":"IF(CT$11=\"\",\"\",VLOOKUP(WEEKDAY(DATE($A$7,$A$9+1-1,CT11),2),Auxiliar!$D$1:$E$7,2,0))","v":""},{"$f":"IF(CU$11=\"\",\"\",VLOOKUP(WEEKDAY(DATE($A$7,$A$9+1-1,CU11),2),Auxiliar!$D$1:$E$7,2,0))","v":""},{"$f":"IF(CV$11=\"\",\"\",VLOOKUP(WEEKDAY(DATE($A$7,$A$9+1-1,CV11),2),Auxiliar!$D$1:$E$7,2,0))","v":""},{"$f":"IF(CW$11=\"\",\"\",VLOOKUP(WEEKDAY(DATE($A$7,$A$9+1-1,CW11),2),Auxiliar!$D$1:$E$7,2,0))","v":""},{"$f":"IF(CX$11=\"\",\"\",VLOOKUP(WEEKDAY(DATE($A$7,$A$9+1-1,CX11),2),Auxiliar!$D$1:$E$7,2,0))","v":""},{"$f":"IF(CY$11=\"\",\"\",VLOOKUP(WEEKDAY(DATE($A$7,$A$9+1-1,CY11),2),Auxiliar!$D$1:$E$7,2,0))","v":""},{"$f":"IF(CZ$11=\"\",\"\",VLOOKUP(WEEKDAY(DATE($A$7,$A$9+1-1,CZ11),2),Auxiliar!$D$1:$E$7,2,0))","v":""},{"$f":"IF(DA$11=\"\",\"\",VLOOKUP(WEEKDAY(DATE($A$7,$A$9+1-1,DA11),2),Auxiliar!$D$1:$E$7,2,0))","v":""},{"$f":"IF(DB$11=\"\",\"\",VLOOKUP(WEEKDAY(DATE($A$7,$A$9+1-1,DB11),2),Auxiliar!$D$1:$E$7,2,0))","v":""},{"$f":"IF(DC$11=\"\",\"\",VLOOKUP(WEEKDAY(DATE($A$7,$A$9+1-1,DC11),2),Auxiliar!$D$1:$E$7,2,0))","v":""},{"$f":"IF(DD$11=\"\",\"\",VLOOKUP(WEEKDAY(DATE($A$7,$A$9+1-1,DD11),2),Auxiliar!$D$1:$E$7,2,0))","v":""},{"$f":"IF(DE$11=\"\",\"\",VLOOKUP(WEEKDAY(DATE($A$7,$A$9+1-1,DE11),2),Auxiliar!$D$1:$E$7,2,0))","v":""},{"$f":"IF(DF$11=\"\",\"\",VLOOKUP(WEEKDAY(DATE($A$7,$A$9+1-1,DF11),2),Auxiliar!$D$1:$E$7,2,0))","v":""},{"$f":"IF(DG$11=\"\",\"\",VLOOKUP(WEEKDAY(DATE($A$7,$A$9+1-1,DG11),2),Auxiliar!$D$1:$E$7,2,0))","v":""},{"$f":"IF(DH$11=\"\",\"\",VLOOKUP(WEEKDAY(DATE($A$7,$A$9+1-1,DH11),2),Auxiliar!$D$1:$E$7,2,0))","v":""},{"$f":"IF(DI$11=\"\",\"\",VLOOKUP(WEEKDAY(DATE($A$7,$A$9+1-1,DI11),2),Auxiliar!$D$1:$E$7,2,0))","v":""},{"$f":"IF(DJ$11=\"\",\"\",VLOOKUP(WEEKDAY(DATE($A$7,$A$9+1-1,DJ11),2),Auxiliar!$D$1:$E$7,2,0))","v":""},{"$f":"IF(DK$11=\"\",\"\",VLOOKUP(WEEKDAY(DATE($A$7,$A$9+1-1,DK11),2),Auxiliar!$D$1:$E$7,2,0))","v":""},{"$f":"IF(DL$11=\"\",\"\",VLOOKUP(WEEKDAY(DATE($A$7,$A$9+1-1,DL11),2),Auxiliar!$D$1:$E$7,2,0))","v":""},{"$f":"IF(DM$11=\"\",\"\",VLOOKUP(WEEKDAY(DATE($A$7,$A$9+1-1,DM11),2),Auxiliar!$D$1:$E$7,2,0))","v":""},{"$f":"IF(DN$11=\"\",\"\",VLOOKUP(WEEKDAY(DATE($A$7,$A$9+1-1,DN11),2),Auxiliar!$D$1:$E$7,2,0))","v":""},{"$f":"IF(DO$11=\"\",\"\",VLOOKUP(WEEKDAY(DATE($A$7,$A$9+1-1,DO11),2),Auxiliar!$D$1:$E$7,2,0))","v":""},{"$f":"IF(DP$11=\"\",\"\",VLOOKUP(WEEKDAY(DATE($A$7,$A$9+1-1,DP11),2),Auxiliar!$D$1:$E$7,2,0))","v":""},{"$f":"IF(DQ$11=\"\",\"\",VLOOKUP(WEEKDAY(DATE($A$7,$A$9+1-1,DQ11),2),Auxiliar!$D$1:$E$7,2,0))","v":""},{"$f":"IF(DR$11=\"\",\"\",VLOOKUP(WEEKDAY(DATE($A$7,$A$9+1-1,DR11),2),Auxiliar!$D$1:$E$7,2,0))","v":""},{"$f":"IF(DS$11=\"\",\"\",VLOOKUP(WEEKDAY(DATE($A$7,$A$9+1-1,DS11),2),Auxiliar!$D$1:$E$7,2,0))","v":""},{"$f":"IF(DT$11=\"\",\"\",VLOOKUP(WEEKDAY(DATE($A$7,$A$9+1-1,DT11),2),Auxiliar!$D$1:$E$7,2,0))","v":""},{"$f":"IF(DU$11=\"\",\"\",VLOOKUP(WEEKDAY(DATE($A$7,$A$9+1-1,DU11),2),Auxiliar!$D$1:$E$7,2,0))","v":""},{"$f":"IF(DV$11=\"\",\"\",VLOOKUP(WEEKDAY(DATE($A$7,$A$9+1-1,DV11),2),Auxiliar!$D$1:$E$7,2,0))","v":""},{"$f":"IF(DW$11=\"\",\"\",VLOOKUP(WEEKDAY(DATE($A$7,$A$9+1-1,DW11),2),Auxiliar!$D$1:$E$7,2,0))","v":""},{"$f":"IF(DX$11=\"\",\"\",VLOOKUP(WEEKDAY(DATE($A$7,$A$9+1-1,DX11),2),Auxiliar!$D$1:$E$7,2,0))","v":""},{"$f":"IF(DY$11=\"\",\"\",VLOOKUP(WEEKDAY(DATE($A$7,$A$9+1-1,DY11),2),Auxiliar!$D$1:$E$7,2,0))","v":""},{"$f":"IF(DZ$11=\"\",\"\",VLOOKUP(WEEKDAY(DATE($A$7,$A$9+1-1,DZ11),2),Auxiliar!$D$1:$E$7,2,0))","v":""},{"$f":"IF(EA$11=\"\",\"\",VLOOKUP(WEEKDAY(DATE($A$7,$A$9+1-1,EA11),2),Auxiliar!$D$1:$E$7,2,0))","v":""},{"$f":"IF(EB$11=\"\",\"\",VLOOKUP(WEEKDAY(DATE($A$7,$A$9+1-1,EB11),2),Auxiliar!$D$1:$E$7,2,0))","v":""},{"$f":"IF(EC$11=\"\",\"\",VLOOKUP(WEEKDAY(DATE($A$7,$A$9+1-1,EC11),2),Auxiliar!$D$1:$E$7,2,0))","v":""},{"$f":"IF(ED$11=\"\",\"\",VLOOKUP(WEEKDAY(DATE($A$7,$A$9+1-1,ED11),2),Auxiliar!$D$1:$E$7,2,0))","v":""},{"$f":"IF(EE$11=\"\",\"\",VLOOKUP(WEEKDAY(DATE($A$7,$A$9+1-1,EE11),2),Auxiliar!$D$1:$E$7,2,0))","v":""},{"$f":"IF(EF$11=\"\",\"\",VLOOKUP(WEEKDAY(DATE($A$7,$A$9+1-1,EF11),2),Auxiliar!$D$1:$E$7,2,0))","v":""},{"$f":"IF(EG$11=\"\",\"\",VLOOKUP(WEEKDAY(DATE($A$7,$A$9+1-1,EG11),2),Auxiliar!$D$1:$E$7,2,0))","v":""},{"$f":"IF(EH$11=\"\",\"\",VLOOKUP(WEEKDAY(DATE($A$7,$A$9+1-1,EH11),2),Auxiliar!$D$1:$E$7,2,0))","v":""},{"$f":"IF(EI$11=\"\",\"\",VLOOKUP(WEEKDAY(DATE($A$7,$A$9+1-1,EI11),2),Auxiliar!$D$1:$E$7,2,0))","v":""},{"$f":"IF(EJ$11=\"\",\"\",VLOOKUP(WEEKDAY(DATE($A$7,$A$9+1-1,EJ11),2),Auxiliar!$D$1:$E$7,2,0))","v":""},{"$f":"IF(EK$11=\"\",\"\",VLOOKUP(WEEKDAY(DATE($A$7,$A$9+1-1,EK11),2),Auxiliar!$D$1:$E$7,2,0))","v":""},{"$f":"IF(EL$11=\"\",\"\",VLOOKUP(WEEKDAY(DATE($A$7,$A$9+1-1,EL11),2),Auxiliar!$D$1:$E$7,2,0))","v":""},{"$f":"IF(EM$11=\"\",\"\",VLOOKUP(WEEKDAY(DATE($A$7,$A$9+1-1,EM11),2),Auxiliar!$D$1:$E$7,2,0))","v":""},{"$f":"IF(EN$11=\"\",\"\",VLOOKUP(WEEKDAY(DATE($A$7,$A$9+1-1,EN11),2),Auxiliar!$D$1:$E$7,2,0))","v":""},{"$f":"IF(EO$11=\"\",\"\",VLOOKUP(WEEKDAY(DATE($A$7,$A$9+1-1,EO11),2),Auxiliar!$D$1:$E$7,2,0))","v":""},{"$f":"IF(EP$11=\"\",\"\",VLOOKUP(WEEKDAY(DATE($A$7,$A$9+1-1,EP11),2),Auxiliar!$D$1:$E$7,2,0))","v":""},{"$f":"IF(EQ$11=\"\",\"\",VLOOKUP(WEEKDAY(DATE($A$7,$A$9+1-1,EQ11),2),Auxiliar!$D$1:$E$7,2,0))","v":""},{"$f":"IF(ER$11=\"\",\"\",VLOOKUP(WEEKDAY(DATE($A$7,$A$9+1-1,ER11),2),Auxiliar!$D$1:$E$7,2,0))","v":""},{"$f":"IF(ES$11=\"\",\"\",VLOOKUP(WEEKDAY(DATE($A$7,$A$9+1-1,ES11),2),Auxiliar!$D$1:$E$7,2,0))","v":""},{"$f":"IF(ET$11=\"\",\"\",VLOOKUP(WEEKDAY(DATE($A$7,$A$9+1-1,ET11),2),Auxiliar!$D$1:$E$7,2,0))","v":""},{"$f":"IF(EU$11=\"\",\"\",VLOOKUP(WEEKDAY(DATE($A$7,$A$9+1-1,EU11),2),Auxiliar!$D$1:$E$7,2,0))","v":""},{"$f":"IF(EV$11=\"\",\"\",VLOOKUP(WEEKDAY(DATE($A$7,$A$9+1-1,EV11),2),Auxiliar!$D$1:$E$7,2,0))","v":""},{"$f":"IF(EW$11=\"\",\"\",VLOOKUP(WEEKDAY(DATE($A$7,$A$9+1-1,EW11),2),Auxiliar!$D$1:$E$7,2,0))","v":""},{"$f":"IF(EX$11=\"\",\"\",VLOOKUP(WEEKDAY(DATE($A$7,$A$9+1-1,EX11),2),Auxiliar!$D$1:$E$7,2,0))","v":""},{"$f":"IF(EY$11=\"\",\"\",VLOOKUP(WEEKDAY(DATE($A$7,$A$9+1-1,EY11),2),Auxiliar!$D$1:$E$7,2,0))","v":""},{"$f":"IF(EZ$11=\"\",\"\",VLOOKUP(WEEKDAY(DATE($A$7,$A$9+1-1,EZ11),2),Auxiliar!$D$1:$E$7,2,0))","v":""},{"$f":"IF(FA$11=\"\",\"\",VLOOKUP(WEEKDAY(DATE($A$7,$A$9+1-1,FA11),2),Auxiliar!$D$1:$E$7,2,0))","v":""},{"$f":"IF(FB$11=\"\",\"\",VLOOKUP(WEEKDAY(DATE($A$7,$A$9+1-1,FB11),2),Auxiliar!$D$1:$E$7,2,0))","v":""},{"$f":"IF(FC$11=\"\",\"\",VLOOKUP(WEEKDAY(DATE($A$7,$A$9+1-1,FC11),2),Auxiliar!$D$1:$E$7,2,0))","v":""},{"$f":"IF(FD$11=\"\",\"\",VLOOKUP(WEEKDAY(DATE($A$7,$A$9+1-1,FD11),2),Auxiliar!$D$1:$E$7,2,0))","v":""},{"$f":"IF(FE$11=\"\",\"\",VLOOKUP(WEEKDAY(DATE($A$7,$A$9+1-1,FE11),2),Auxiliar!$D$1:$E$7,2,0))","v":""},{"$f":"IF(FF$11=\"\",\"\",VLOOKUP(WEEKDAY(DATE($A$7,$A$9+1-1,FF11),2),Auxiliar!$D$1:$E$7,2,0))","v":""},{"$f":"IF(FG$11=\"\",\"\",VLOOKUP(WEEKDAY(DATE($A$7,$A$9+1-1,FG11),2),Auxiliar!$D$1:$E$7,2,0))","v":""},{"$f":"IF(FH$11=\"\",\"\",VLOOKUP(WEEKDAY(DATE($A$7,$A$9+1-1,FH11),2),Auxiliar!$D$1:$E$7,2,0))","v":""},{"$f":"IF(FI$11=\"\",\"\",VLOOKUP(WEEKDAY(DATE($A$7,$A$9+1-1,FI11),2),Auxiliar!$D$1:$E$7,2,0))","v":""},{"$f":"IF(FJ$11=\"\",\"\",VLOOKUP(WEEKDAY(DATE($A$7,$A$9+1-1,FJ11),2),Auxiliar!$D$1:$E$7,2,0))","v":""},{"$f":"IF(FK$11=\"\",\"\",VLOOKUP(WEEKDAY(DATE($A$7,$A$9+1-1,FK11),2),Auxiliar!$D$1:$E$7,2,0))","v":""},{"$f":"IF(FL$11=\"\",\"\",VLOOKUP(WEEKDAY(DATE($A$7,$A$9+1-1,FL11),2),Auxiliar!$D$1:$E$7,2,0))","v":""},{"$f":"IF(FM$11=\"\",\"\",VLOOKUP(WEEKDAY(DATE($A$7,$A$9+1-1,FM11),2),Auxiliar!$D$1:$E$7,2,0))","v":""},{"$f":"IF(FN$11=\"\",\"\",VLOOKUP(WEEKDAY(DATE($A$7,$A$9+1-1,FN11),2),Auxiliar!$D$1:$E$7,2,0))","v":""},{"$f":"IF(FO$11=\"\",\"\",VLOOKUP(WEEKDAY(DATE($A$7,$A$9+1-1,FO11),2),Auxiliar!$D$1:$E$7,2,0))","v":""},{"$f":"IF(FP$11=\"\",\"\",VLOOKUP(WEEKDAY(DATE($A$7,$A$9+1-1,FP11),2),Auxiliar!$D$1:$E$7,2,0))","v":""},{"$f":"IF(FQ$11=\"\",\"\",VLOOKUP(WEEKDAY(DATE($A$7,$A$9+1-1,FQ11),2),Auxiliar!$D$1:$E$7,2,0))","v":""},{"$f":"IF(FR$11=\"\",\"\",VLOOKUP(WEEKDAY(DATE($A$7,$A$9+1-1,FR11),2),Auxiliar!$D$1:$E$7,2,0))","v":""},{"$f":"IF(FS$11=\"\",\"\",VLOOKUP(WEEKDAY(DATE($A$7,$A$9+1-1,FS11),2),Auxiliar!$D$1:$E$7,2,0))","v":""},{"$f":"IF(FT$11=\"\",\"\",VLOOKUP(WEEKDAY(DATE($A$7,$A$9+1-1,FT11),2),Auxiliar!$D$1:$E$7,2,0))","v":""},{"$f":"IF(FU$11=\"\",\"\",VLOOKUP(WEEKDAY(DATE($A$7,$A$9+1-1,FU11),2),Auxiliar!$D$1:$E$7,2,0))","v":""},{"$f":"IF(FV$11=\"\",\"\",VLOOKUP(WEEKDAY(DATE($A$7,$A$9+1-1,FV11),2),Auxiliar!$D$1:$E$7,2,0))","v":""},{"$f":"IF(FW$11=\"\",\"\",VLOOKUP(WEEKDAY(DATE($A$7,$A$9+1-1,FW11),2),Auxiliar!$D$1:$E$7,2,0))","v":""},{"$f":"IF(FX$11=\"\",\"\",VLOOKUP(WEEKDAY(DATE($A$7,$A$9+1-1,FX11),2),Auxiliar!$D$1:$E$7,2,0))","v":""},{"$f":"IF(FY$11=\"\",\"\",VLOOKUP(WEEKDAY(DATE($A$7,$A$9+1-1,FY11),2),Auxiliar!$D$1:$E$7,2,0))","v":""},{"$f":"IF(FZ$11=\"\",\"\",VLOOKUP(WEEKDAY(DATE($A$7,$A$9+1-1,FZ11),2),Auxiliar!$D$1:$E$7,2,0))","v":""},{"$f":"IF(GA$11=\"\",\"\",VLOOKUP(WEEKDAY(DATE($A$7,$A$9+1-1,GA11),2),Auxiliar!$D$1:$E$7,2,0))","v":""},{"$f":"IF(GB$11=\"\",\"\",VLOOKUP(WEEKDAY(DATE($A$7,$A$9+1-1,GB11),2),Auxiliar!$D$1:$E$7,2,0))","v":""},{"$f":"IF(GC$11=\"\",\"\",VLOOKUP(WEEKDAY(DATE($A$7,$A$9+1-1,GC11),2),Auxiliar!$D$1:$E$7,2,0))","v":""},{"$f":"IF(GD$11=\"\",\"\",VLOOKUP(WEEKDAY(DATE($A$7,$A$9+1-1,GD11),2),Auxiliar!$D$1:$E$7,2,0))","v":""},{"$f":"IF(GE$11=\"\",\"\",VLOOKUP(WEEKDAY(DATE($A$7,$A$9+1-1,GE11),2),Auxiliar!$D$1:$E$7,2,0))","v":""},{"$f":"IF(GF$11=\"\",\"\",VLOOKUP(WEEKDAY(DATE($A$7,$A$9+1-1,GF11),2),Auxiliar!$D$1:$E$7,2,0))","v":""},{"$f":"IF(GG$11=\"\",\"\",VLOOKUP(WEEKDAY(DATE($A$7,$A$9+1-1,GG11),2),Auxiliar!$D$1:$E$7,2,0))","v":""},{"$f":"IF(GH$11=\"\",\"\",VLOOKUP(WEEKDAY(DATE($A$7,$A$9+1-1,GH11),2),Auxiliar!$D$1:$E$7,2,0))","v":""},{"$f":"IF(GI$11=\"\",\"\",VLOOKUP(WEEKDAY(DATE($A$7,$A$9+1-1,GI11),2),Auxiliar!$D$1:$E$7,2,0))","v":""},{"$f":"IF(GJ$11=\"\",\"\",VLOOKUP(WEEKDAY(DATE($A$7,$A$9+1-1,GJ11),2),Auxiliar!$D$1:$E$7,2,0))","v":""},{"$f":"IF(GK$11=\"\",\"\",VLOOKUP(WEEKDAY(DATE($A$7,$A$9+1-1,GK11),2),Auxiliar!$D$1:$E$7,2,0))","v":""},{"$f":"IF(GL$11=\"\",\"\",VLOOKUP(WEEKDAY(DATE($A$7,$A$9+1-1,GL11),2),Auxiliar!$D$1:$E$7,2,0))","v":""},{"$f":"IF(GM$11=\"\",\"\",VLOOKUP(WEEKDAY(DATE($A$7,$A$9+1-1,GM11),2),Auxiliar!$D$1:$E$7,2,0))","v":""},{"$f":"IF(GN$11=\"\",\"\",VLOOKUP(WEEKDAY(DATE($A$7,$A$9+1-1,GN11),2),Auxiliar!$D$1:$E$7,2,0))","v":""},{"$f":"IF(GO$11=\"\",\"\",VLOOKUP(WEEKDAY(DATE($A$7,$A$9+1-1,GO11),2),Auxiliar!$D$1:$E$7,2,0))","v":""},{"$f":"IF(GP$11=\"\",\"\",VLOOKUP(WEEKDAY(DATE($A$7,$A$9+1-1,GP11),2),Auxiliar!$D$1:$E$7,2,0))","v":""},{"$f":"IF(GQ$11=\"\",\"\",VLOOKUP(WEEKDAY(DATE($A$7,$A$9+1-1,GQ11),2),Auxiliar!$D$1:$E$7,2,0))","v":""},{"$f":"IF(GR$11=\"\",\"\",VLOOKUP(WEEKDAY(DATE($A$7,$A$9+1-1,GR11),2),Auxiliar!$D$1:$E$7,2,0))","v":""},{"$f":"IF(GS$11=\"\",\"\",VLOOKUP(WEEKDAY(DATE($A$7,$A$9+1-1,GS11),2),Auxiliar!$D$1:$E$7,2,0))","v":""},{"$f":"IF(GT$11=\"\",\"\",VLOOKUP(WEEKDAY(DATE($A$7,$A$9+1-1,GT11),2),Auxiliar!$D$1:$E$7,2,0))","v":""},{"$f":"IF(GU$11=\"\",\"\",VLOOKUP(WEEKDAY(DATE($A$7,$A$9+1-1,GU11),2),Auxiliar!$D$1:$E$7,2,0))","v":""},{"$f":"IF(GV$11=\"\",\"\",VLOOKUP(WEEKDAY(DATE($A$7,$A$9+1-1,GV11),2),Auxiliar!$D$1:$E$7,2,0))","v":""},{"$f":"IF(GW$11=\"\",\"\",VLOOKUP(WEEKDAY(DATE($A$7,$A$9+1-1,GW11),2),Auxiliar!$D$1:$E$7,2,0))","v":""},{"$f":"IF(GX$11=\"\",\"\",VLOOKUP(WEEKDAY(DATE($A$7,$A$9+1-1,GX11),2),Auxiliar!$D$1:$E$7,2,0))","v":""},{"$f":"IF(GY$11=\"\",\"\",VLOOKUP(WEEKDAY(DATE($A$7,$A$9+1-1,GY11),2),Auxiliar!$D$1:$E$7,2,0))","v":""},{"$f":"IF(GZ$11=\"\",\"\",VLOOKUP(WEEKDAY(DATE($A$7,$A$9+1-1,GZ11),2),Auxiliar!$D$1:$E$7,2,0))","v":""},{"$f":"IF(HA$11=\"\",\"\",VLOOKUP(WEEKDAY(DATE($A$7,$A$9+1-1,HA11),2),Auxiliar!$D$1:$E$7,2,0))","v":""},{"$f":"IF(HB$11=\"\",\"\",VLOOKUP(WEEKDAY(DATE($A$7,$A$9+1-1,HB11),2),Auxiliar!$D$1:$E$7,2,0))","v":""},{"$f":"IF(HC$11=\"\",\"\",VLOOKUP(WEEKDAY(DATE($A$7,$A$9+1-1,HC11),2),Auxiliar!$D$1:$E$7,2,0))","v":""},{"$f":"IF(HD$11=\"\",\"\",VLOOKUP(WEEKDAY(DATE($A$7,$A$9+1-1,HD11),2),Auxiliar!$D$1:$E$7,2,0))","v":""},{"$f":"IF(HE$11=\"\",\"\",VLOOKUP(WEEKDAY(DATE($A$7,$A$9+1-1,HE11),2),Auxiliar!$D$1:$E$7,2,0))","v":""},{"$f":"IF(HF$11=\"\",\"\",VLOOKUP(WEEKDAY(DATE($A$7,$A$9+1-1,HF11),2),Auxiliar!$D$1:$E$7,2,0))","v":""},{"$f":"IF(HG$11=\"\",\"\",VLOOKUP(WEEKDAY(DATE($A$7,$A$9+1-1,HG11),2),Auxiliar!$D$1:$E$7,2,0))","v":""},{"$f":"IF(HH$11=\"\",\"\",VLOOKUP(WEEKDAY(DATE($A$7,$A$9+1-1,HH11),2),Auxiliar!$D$1:$E$7,2,0))","v":""},{"$f":"IF(HI$11=\"\",\"\",VLOOKUP(WEEKDAY(DATE($A$7,$A$9+1-1,HI11),2),Auxiliar!$D$1:$E$7,2,0))","v":""},{"$f":"IF(HJ$11=\"\",\"\",VLOOKUP(WEEKDAY(DATE($A$7,$A$9+1-1,HJ11),2),Auxiliar!$D$1:$E$7,2,0))","v":""},{"$f":"IF(HK$11=\"\",\"\",VLOOKUP(WEEKDAY(DATE($A$7,$A$9+1-1,HK11),2),Auxiliar!$D$1:$E$7,2,0))","v":""},{"$f":"IF(HL$11=\"\",\"\",VLOOKUP(WEEKDAY(DATE($A$7,$A$9+1-1,HL11),2),Auxiliar!$D$1:$E$7,2,0))","v":""},{"$f":"IF(HM$11=\"\",\"\",VLOOKUP(WEEKDAY(DATE($A$7,$A$9+1-1,HM11),2),Auxiliar!$D$1:$E$7,2,0))","v":""},{"$f":"IF(HN$11=\"\",\"\",VLOOKUP(WEEKDAY(DATE($A$7,$A$9+1-1,HN11),2),Auxiliar!$D$1:$E$7,2,0))","v":""},{"$f":"IF(HO$11=\"\",\"\",VLOOKUP(WEEKDAY(DATE($A$7,$A$9+1-1,HO11),2),Auxiliar!$D$1:$E$7,2,0))","v":""},{"$f":"IF(HP$11=\"\",\"\",VLOOKUP(WEEKDAY(DATE($A$7,$A$9+1-1,HP11),2),Auxiliar!$D$1:$E$7,2,0))","v":""},{"$f":"IF(HQ$11=\"\",\"\",VLOOKUP(WEEKDAY(DATE($A$7,$A$9+1-1,HQ11),2),Auxiliar!$D$1:$E$7,2,0))","v":""},{"$f":"IF(HR$11=\"\",\"\",VLOOKUP(WEEKDAY(DATE($A$7,$A$9+1-1,HR11),2),Auxiliar!$D$1:$E$7,2,0))","v":""},{"$f":"IF(HS$11=\"\",\"\",VLOOKUP(WEEKDAY(DATE($A$7,$A$9+1-1,HS11),2),Auxiliar!$D$1:$E$7,2,0))","v":""},{"$f":"IF(HT$11=\"\",\"\",VLOOKUP(WEEKDAY(DATE($A$7,$A$9+1-1,HT11),2),Auxiliar!$D$1:$E$7,2,0))","v":""},{"$f":"IF(HU$11=\"\",\"\",VLOOKUP(WEEKDAY(DATE($A$7,$A$9+1-1,HU11),2),Auxiliar!$D$1:$E$7,2,0))","v":""},{"$f":"IF(HV$11=\"\",\"\",VLOOKUP(WEEKDAY(DATE($A$7,$A$9+1-1,HV11),2),Auxiliar!$D$1:$E$7,2,0))","v":""},{"$f":"IF(HW$11=\"\",\"\",VLOOKUP(WEEKDAY(DATE($A$7,$A$9+1-1,HW11),2),Auxiliar!$D$1:$E$7,2,0))","v":""},{"$f":"IF(HX$11=\"\",\"\",VLOOKUP(WEEKDAY(DATE($A$7,$A$9+1-1,HX11),2),Auxiliar!$D$1:$E$7,2,0))","v":""},{"$f":"IF(HY$11=\"\",\"\",VLOOKUP(WEEKDAY(DATE($A$7,$A$9+1-1,HY11),2),Auxiliar!$D$1:$E$7,2,0))","v":""},{"$f":"IF(HZ$11=\"\",\"\",VLOOKUP(WEEKDAY(DATE($A$7,$A$9+1-1,HZ11),2),Auxiliar!$D$1:$E$7,2,0))","v":""},{"$f":"IF(IA$11=\"\",\"\",VLOOKUP(WEEKDAY(DATE($A$7,$A$9+1-1,IA11),2),Auxiliar!$D$1:$E$7,2,0))","v":""},{"$f":"IF(IB$11=\"\",\"\",VLOOKUP(WEEKDAY(DATE($A$7,$A$9+1-1,IB11),2),Auxiliar!$D$1:$E$7,2,0))","v":""},{"$f":"IF(IC$11=\"\",\"\",VLOOKUP(WEEKDAY(DATE($A$7,$A$9+1-1,IC11),2),Auxiliar!$D$1:$E$7,2,0))","v":""},{"$f":"IF(ID$11=\"\",\"\",VLOOKUP(WEEKDAY(DATE($A$7,$A$9+1-1,ID11),2),Auxiliar!$D$1:$E$7,2,0))","v":""},{"$f":"IF(IE$11=\"\",\"\",VLOOKUP(WEEKDAY(DATE($A$7,$A$9+1-1,IE11),2),Auxiliar!$D$1:$E$7,2,0))","v":""},{"$f":"IF(IF$11=\"\",\"\",VLOOKUP(WEEKDAY(DATE($A$7,$A$9+1-1,IF11),2),Auxiliar!$D$1:$E$7,2,0))","v":""},{"$f":"IF(IG$11=\"\",\"\",VLOOKUP(WEEKDAY(DATE($A$7,$A$9+1-1,IG11),2),Auxiliar!$D$1:$E$7,2,0))","v":""},{"$f":"IF(IH$11=\"\",\"\",VLOOKUP(WEEKDAY(DATE($A$7,$A$9+1-1,IH11),2),Auxiliar!$D$1:$E$7,2,0))","v":""},{"$f":"IF(II$11=\"\",\"\",VLOOKUP(WEEKDAY(DATE($A$7,$A$9+1-1,II11),2),Auxiliar!$D$1:$E$7,2,0))","v":""},{"$f":"IF(IJ$11=\"\",\"\",VLOOKUP(WEEKDAY(DATE($A$7,$A$9+1-1,IJ11),2),Auxiliar!$D$1:$E$7,2,0))","v":""},{"$f":"IF(IK$11=\"\",\"\",VLOOKUP(WEEKDAY(DATE($A$7,$A$9+1-1,IK11),2),Auxiliar!$D$1:$E$7,2,0))","v":""},{"$f":"IF(IL$11=\"\",\"\",VLOOKUP(WEEKDAY(DATE($A$7,$A$9+1-1,IL11),2),Auxiliar!$D$1:$E$7,2,0))","v":""},{"$f":"IF(IM$11=\"\",\"\",VLOOKUP(WEEKDAY(DATE($A$7,$A$9+1-1,IM11),2),Auxiliar!$D$1:$E$7,2,0))","v":""},{"$f":"IF(IN$11=\"\",\"\",VLOOKUP(WEEKDAY(DATE($A$7,$A$9+1-1,IN11),2),Auxiliar!$D$1:$E$7,2,0))","v":""},{"$f":"IF(IO$11=\"\",\"\",VLOOKUP(WEEKDAY(DATE($A$7,$A$9+1-1,IO11),2),Auxiliar!$D$1:$E$7,2,0))","v":""},{"$f":"IF(IP$11=\"\",\"\",VLOOKUP(WEEKDAY(DATE($A$7,$A$9+1-1,IP11),2),Auxiliar!$D$1:$E$7,2,0))","v":""},{"$f":"IF(IQ$11=\"\",\"\",VLOOKUP(WEEKDAY(DATE($A$7,$A$9+1-1,IQ11),2),Auxiliar!$D$1:$E$7,2,0))","v":""},{"$f":"IF(IR$11=\"\",\"\",VLOOKUP(WEEKDAY(DATE($A$7,$A$9+1-1,IR11),2),Auxiliar!$D$1:$E$7,2,0))","v":""},{"$f":"IF(IS$11=\"\",\"\",VLOOKUP(WEEKDAY(DATE($A$7,$A$9+1-1,IS11),2),Auxiliar!$D$1:$E$7,2,0))","v":""},{"$f":"IF(IT$11=\"\",\"\",VLOOKUP(WEEKDAY(DATE($A$7,$A$9+1-1,IT11),2),Auxiliar!$D$1:$E$7,2,0))","v":""},{"$f":"IF(IU$11=\"\",\"\",VLOOKUP(WEEKDAY(DATE($A$7,$A$9+1-1,IU11),2),Auxiliar!$D$1:$E$7,2,0))","v":""},{"$f":"IF(IV$11=\"\",\"\",VLOOKUP(WEEKDAY(DATE($A$7,$A$9+1-1,IV11),2),Auxiliar!$D$1:$E$7,2,0))","v":""},{"$f":"IF(IW$11=\"\",\"\",VLOOKUP(WEEKDAY(DATE($A$7,$A$9+1-1,IW11),2),Auxiliar!$D$1:$E$7,2,0))","v":""},{"$f":"IF(IX$11=\"\",\"\",VLOOKUP(WEEKDAY(DATE($A$7,$A$9+1-1,IX11),2),Auxiliar!$D$1:$E$7,2,0))","v":""},{"$f":"IF(IY$11=\"\",\"\",VLOOKUP(WEEKDAY(DATE($A$7,$A$9+1-1,IY11),2),Auxiliar!$D$1:$E$7,2,0))","v":""},{"$f":"IF(IZ$11=\"\",\"\",VLOOKUP(WEEKDAY(DATE($A$7,$A$9+1-1,IZ11),2),Auxiliar!$D$1:$E$7,2,0))","v":""},{"$f":"IF(JA$11=\"\",\"\",VLOOKUP(WEEKDAY(DATE($A$7,$A$9+1-1,JA11),2),Auxiliar!$D$1:$E$7,2,0))","v":""},{"$f":"IF(JB$11=\"\",\"\",VLOOKUP(WEEKDAY(DATE($A$7,$A$9+1-1,JB11),2),Auxiliar!$D$1:$E$7,2,0))","v":""},{"$f":"IF(JC$11=\"\",\"\",VLOOKUP(WEEKDAY(DATE($A$7,$A$9+1-1,JC11),2),Auxiliar!$D$1:$E$7,2,0))","v":""},{"$f":"IF(JD$11=\"\",\"\",VLOOKUP(WEEKDAY(DATE($A$7,$A$9+1-1,JD11),2),Auxiliar!$D$1:$E$7,2,0))","v":""},{"$f":"IF(JE$11=\"\",\"\",VLOOKUP(WEEKDAY(DATE($A$7,$A$9+1-1,JE11),2),Auxiliar!$D$1:$E$7,2,0))","v":""},{"$f":"IF(JF$11=\"\",\"\",VLOOKUP(WEEKDAY(DATE($A$7,$A$9+1-1,JF11),2),Auxiliar!$D$1:$E$7,2,0))","v":""},{"$f":"IF(JG$11=\"\",\"\",VLOOKUP(WEEKDAY(DATE($A$7,$A$9+1-1,JG11),2),Auxiliar!$D$1:$E$7,2,0))","v":""},{"$f":"IF(JH$11=\"\",\"\",VLOOKUP(WEEKDAY(DATE($A$7,$A$9+1-1,JH11),2),Auxiliar!$D$1:$E$7,2,0))","v":""},{"$f":"IF(JI$11=\"\",\"\",VLOOKUP(WEEKDAY(DATE($A$7,$A$9+1-1,JI11),2),Auxiliar!$D$1:$E$7,2,0))","v":""},{"$f":"IF(JJ$11=\"\",\"\",VLOOKUP(WEEKDAY(DATE($A$7,$A$9+1-1,JJ11),2),Auxiliar!$D$1:$E$7,2,0))","v":""},{"$f":"IF(JK$11=\"\",\"\",VLOOKUP(WEEKDAY(DATE($A$7,$A$9+1-1,JK11),2),Auxiliar!$D$1:$E$7,2,0))","v":""},{"$f":"IF(JL$11=\"\",\"\",VLOOKUP(WEEKDAY(DATE($A$7,$A$9+1-1,JL11),2),Auxiliar!$D$1:$E$7,2,0))","v":""},{"$f":"IF(JM$11=\"\",\"\",VLOOKUP(WEEKDAY(DATE($A$7,$A$9+1-1,JM11),2),Auxiliar!$D$1:$E$7,2,0))","v":""},{"$f":"IF(JN$11=\"\",\"\",VLOOKUP(WEEKDAY(DATE($A$7,$A$9+1-1,JN11),2),Auxiliar!$D$1:$E$7,2,0))","v":""},{"$f":"IF(JO$11=\"\",\"\",VLOOKUP(WEEKDAY(DATE($A$7,$A$9+1-1,JO11),2),Auxiliar!$D$1:$E$7,2,0))","v":""},{"$f":"IF(JP$11=\"\",\"\",VLOOKUP(WEEKDAY(DATE($A$7,$A$9+1-1,JP11),2),Auxiliar!$D$1:$E$7,2,0))","v":""},{"$f":"IF(JQ$11=\"\",\"\",VLOOKUP(WEEKDAY(DATE($A$7,$A$9+1-1,JQ11),2),Auxiliar!$D$1:$E$7,2,0))","v":""},{"$f":"IF(JR$11=\"\",\"\",VLOOKUP(WEEKDAY(DATE($A$7,$A$9+1-1,JR11),2),Auxiliar!$D$1:$E$7,2,0))","v":""},{"$f":"IF(JS$11=\"\",\"\",VLOOKUP(WEEKDAY(DATE($A$7,$A$9+1-1,JS11),2),Auxiliar!$D$1:$E$7,2,0))","v":""},{"$f":"IF(JT$11=\"\",\"\",VLOOKUP(WEEKDAY(DATE($A$7,$A$9+1-1,JT11),2),Auxiliar!$D$1:$E$7,2,0))","v":""},{"$f":"IF(JU$11=\"\",\"\",VLOOKUP(WEEKDAY(DATE($A$7,$A$9+1-1,JU11),2),Auxiliar!$D$1:$E$7,2,0))","v":""},{"$f":"IF(JV$11=\"\",\"\",VLOOKUP(WEEKDAY(DATE($A$7,$A$9+1-1,JV11),2),Auxiliar!$D$1:$E$7,2,0))","v":""},{"$f":"IF(JW$11=\"\",\"\",VLOOKUP(WEEKDAY(DATE($A$7,$A$9+1-1,JW11),2),Auxiliar!$D$1:$E$7,2,0))","v":""},{"$f":"IF(JX$11=\"\",\"\",VLOOKUP(WEEKDAY(DATE($A$7,$A$9+1-1,JX11),2),Auxiliar!$D$1:$E$7,2,0))","v":""},{"$f":"IF(JY$11=\"\",\"\",VLOOKUP(WEEKDAY(DATE($A$7,$A$9+1-1,JY11),2),Auxiliar!$D$1:$E$7,2,0))","v":""},{"$f":"IF(JZ$11=\"\",\"\",VLOOKUP(WEEKDAY(DATE($A$7,$A$9+1-1,JZ11),2),Auxiliar!$D$1:$E$7,2,0))","v":""},{"$f":"IF(KA$11=\"\",\"\",VLOOKUP(WEEKDAY(DATE($A$7,$A$9+1-1,KA11),2),Auxiliar!$D$1:$E$7,2,0))","v":""},{"$f":"IF(KB$11=\"\",\"\",VLOOKUP(WEEKDAY(DATE($A$7,$A$9+1-1,KB11),2),Auxiliar!$D$1:$E$7,2,0))","v":""},{"$f":"IF(KC$11=\"\",\"\",VLOOKUP(WEEKDAY(DATE($A$7,$A$9+1-1,KC11),2),Auxiliar!$D$1:$E$7,2,0))","v":""},{"$f":"IF(KD$11=\"\",\"\",VLOOKUP(WEEKDAY(DATE($A$7,$A$9+1-1,KD11),2),Auxiliar!$D$1:$E$7,2,0))","v":""},{"$f":"IF(KE$11=\"\",\"\",VLOOKUP(WEEKDAY(DATE($A$7,$A$9+1-1,KE11),2),Auxiliar!$D$1:$E$7,2,0))","v":""},{"$f":"IF(KF$11=\"\",\"\",VLOOKUP(WEEKDAY(DATE($A$7,$A$9+1-1,KF11),2),Auxiliar!$D$1:$E$7,2,0))","v":""},{"$f":"IF(KG$11=\"\",\"\",VLOOKUP(WEEKDAY(DATE($A$7,$A$9+1-1,KG11),2),Auxiliar!$D$1:$E$7,2,0))","v":""},{"$f":"IF(KH$11=\"\",\"\",VLOOKUP(WEEKDAY(DATE($A$7,$A$9+1-1,KH11),2),Auxiliar!$D$1:$E$7,2,0))","v":""},{"$f":"IF(KI$11=\"\",\"\",VLOOKUP(WEEKDAY(DATE($A$7,$A$9+1-1,KI11),2),Auxiliar!$D$1:$E$7,2,0))","v":""},{"$f":"IF(KJ$11=\"\",\"\",VLOOKUP(WEEKDAY(DATE($A$7,$A$9+1-1,KJ11),2),Auxiliar!$D$1:$E$7,2,0))","v":""},{"$f":"IF(KK$11=\"\",\"\",VLOOKUP(WEEKDAY(DATE($A$7,$A$9+1-1,KK11),2),Auxiliar!$D$1:$E$7,2,0))","v":""},{"$f":"IF(KL$11=\"\",\"\",VLOOKUP(WEEKDAY(DATE($A$7,$A$9+1-1,KL11),2),Auxiliar!$D$1:$E$7,2,0))","v":""},{"$f":"IF(KM$11=\"\",\"\",VLOOKUP(WEEKDAY(DATE($A$7,$A$9+1-1,KM11),2),Auxiliar!$D$1:$E$7,2,0))","v":""},{"$f":"IF(KN$11=\"\",\"\",VLOOKUP(WEEKDAY(DATE($A$7,$A$9+1-1,KN11),2),Auxiliar!$D$1:$E$7,2,0))","v":""},{"$f":"IF(KO$11=\"\",\"\",VLOOKUP(WEEKDAY(DATE($A$7,$A$9+1-1,KO11),2),Auxiliar!$D$1:$E$7,2,0))","v":""},{"$f":"IF(KP$11=\"\",\"\",VLOOKUP(WEEKDAY(DATE($A$7,$A$9+1-1,KP11),2),Auxiliar!$D$1:$E$7,2,0))","v":""},{"$f":"IF(KQ$11=\"\",\"\",VLOOKUP(WEEKDAY(DATE($A$7,$A$9+1-1,KQ11),2),Auxiliar!$D$1:$E$7,2,0))","v":""},{"$f":"IF(KR$11=\"\",\"\",VLOOKUP(WEEKDAY(DATE($A$7,$A$9+1-1,KR11),2),Auxiliar!$D$1:$E$7,2,0))","v":""},{"$f":"IF(KS$11=\"\",\"\",VLOOKUP(WEEKDAY(DATE($A$7,$A$9+1-1,KS11),2),Auxiliar!$D$1:$E$7,2,0))","v":""},{"$f":"IF(KT$11=\"\",\"\",VLOOKUP(WEEKDAY(DATE($A$7,$A$9+1-1,KT11),2),Auxiliar!$D$1:$E$7,2,0))","v":""},{"$f":"IF(KU$11=\"\",\"\",VLOOKUP(WEEKDAY(DATE($A$7,$A$9+1-1,KU11),2),Auxiliar!$D$1:$E$7,2,0))","v":""},{"$f":"IF(KV$11=\"\",\"\",VLOOKUP(WEEKDAY(DATE($A$7,$A$9+1-1,KV11),2),Auxiliar!$D$1:$E$7,2,0))","v":""},{"$f":"IF(KW$11=\"\",\"\",VLOOKUP(WEEKDAY(DATE($A$7,$A$9+1-1,KW11),2),Auxiliar!$D$1:$E$7,2,0))","v":""},{"$f":"IF(KX$11=\"\",\"\",VLOOKUP(WEEKDAY(DATE($A$7,$A$9+1-1,KX11),2),Auxiliar!$D$1:$E$7,2,0))","v":""},{"$f":"IF(KY$11=\"\",\"\",VLOOKUP(WEEKDAY(DATE($A$7,$A$9+1-1,KY11),2),Auxiliar!$D$1:$E$7,2,0))","v":""},{"$f":"IF(KZ$11=\"\",\"\",VLOOKUP(WEEKDAY(DATE($A$7,$A$9+1-1,KZ11),2),Auxiliar!$D$1:$E$7,2,0))","v":""},{"$f":"IF(LA$11=\"\",\"\",VLOOKUP(WEEKDAY(DATE($A$7,$A$9+1-1,LA11),2),Auxiliar!$D$1:$E$7,2,0))","v":""},{"$f":"IF(LB$11=\"\",\"\",VLOOKUP(WEEKDAY(DATE($A$7,$A$9+1-1,LB11),2),Auxiliar!$D$1:$E$7,2,0))","v":""},{"$f":"IF(LC$11=\"\",\"\",VLOOKUP(WEEKDAY(DATE($A$7,$A$9+1-1,LC11),2),Auxiliar!$D$1:$E$7,2,0))","v":""},{"$f":"IF(LD$11=\"\",\"\",VLOOKUP(WEEKDAY(DATE($A$7,$A$9+1-1,LD11),2),Auxiliar!$D$1:$E$7,2,0))","v":""},{"$f":"IF(LE$11=\"\",\"\",VLOOKUP(WEEKDAY(DATE($A$7,$A$9+1-1,LE11),2),Auxiliar!$D$1:$E$7,2,0))","v":""},{"$f":"IF(LF$11=\"\",\"\",VLOOKUP(WEEKDAY(DATE($A$7,$A$9+1-1,LF11),2),Auxiliar!$D$1:$E$7,2,0))","v":""},{"$f":"IF(LG$11=\"\",\"\",VLOOKUP(WEEKDAY(DATE($A$7,$A$9+1-1,LG11),2),Auxiliar!$D$1:$E$7,2,0))","v":""},{"$f":"IF(LH$11=\"\",\"\",VLOOKUP(WEEKDAY(DATE($A$7,$A$9+1-1,LH11),2),Auxiliar!$D$1:$E$7,2,0))","v":""},{"$f":"IF(LI$11=\"\",\"\",VLOOKUP(WEEKDAY(DATE($A$7,$A$9+1-1,LI11),2),Auxiliar!$D$1:$E$7,2,0))","v":""},{"$f":"IF(LJ$11=\"\",\"\",VLOOKUP(WEEKDAY(DATE($A$7,$A$9+1-1,LJ11),2),Auxiliar!$D$1:$E$7,2,0))","v":""},{"$f":"IF(LK$11=\"\",\"\",VLOOKUP(WEEKDAY(DATE($A$7,$A$9+1-1,LK11),2),Auxiliar!$D$1:$E$7,2,0))","v":""},{"$f":"IF(LL$11=\"\",\"\",VLOOKUP(WEEKDAY(DATE($A$7,$A$9+1-1,LL11),2),Auxiliar!$D$1:$E$7,2,0))","v":""},{"$f":"IF(LM$11=\"\",\"\",VLOOKUP(WEEKDAY(DATE($A$7,$A$9+1-1,LM11),2),Auxiliar!$D$1:$E$7,2,0))","v":""},{"$f":"IF(LN$11=\"\",\"\",VLOOKUP(WEEKDAY(DATE($A$7,$A$9+1-1,LN11),2),Auxiliar!$D$1:$E$7,2,0))","v":""},{"$f":"IF(LO$11=\"\",\"\",VLOOKUP(WEEKDAY(DATE($A$7,$A$9+1-1,LO11),2),Auxiliar!$D$1:$E$7,2,0))","v":""},{"$f":"IF(LP$11=\"\",\"\",VLOOKUP(WEEKDAY(DATE($A$7,$A$9+1-1,LP11),2),Auxiliar!$D$1:$E$7,2,0))","v":""},{"$f":"IF(LQ$11=\"\",\"\",VLOOKUP(WEEKDAY(DATE($A$7,$A$9+1-1,LQ11),2),Auxiliar!$D$1:$E$7,2,0))","v":""},{"$f":"IF(LR$11=\"\",\"\",VLOOKUP(WEEKDAY(DATE($A$7,$A$9+1-1,LR11),2),Auxiliar!$D$1:$E$7,2,0))","v":""},{"$f":"IF(LS$11=\"\",\"\",VLOOKUP(WEEKDAY(DATE($A$7,$A$9+1-1,LS11),2),Auxiliar!$D$1:$E$7,2,0))","v":""},{"$f":"IF(LT$11=\"\",\"\",VLOOKUP(WEEKDAY(DATE($A$7,$A$9+1-1,LT11),2),Auxiliar!$D$1:$E$7,2,0))","v":""},{"$f":"IF(LU$11=\"\",\"\",VLOOKUP(WEEKDAY(DATE($A$7,$A$9+1-1,LU11),2),Auxiliar!$D$1:$E$7,2,0))","v":""},{"$f":"IF(LV$11=\"\",\"\",VLOOKUP(WEEKDAY(DATE($A$7,$A$9+1-1,LV11),2),Auxiliar!$D$1:$E$7,2,0))","v":""},{"$f":"IF(LW$11=\"\",\"\",VLOOKUP(WEEKDAY(DATE($A$7,$A$9+1-1,LW11),2),Auxiliar!$D$1:$E$7,2,0))","v":""},{"$f":"IF(LX$11=\"\",\"\",VLOOKUP(WEEKDAY(DATE($A$7,$A$9+1-1,LX11),2),Auxiliar!$D$1:$E$7,2,0))","v":""},{"$f":"IF(LY$11=\"\",\"\",VLOOKUP(WEEKDAY(DATE($A$7,$A$9+1-1,LY11),2),Auxiliar!$D$1:$E$7,2,0))","v":""},{"$f":"IF(LZ$11=\"\",\"\",VLOOKUP(WEEKDAY(DATE($A$7,$A$9+1-1,LZ11),2),Auxiliar!$D$1:$E$7,2,0))","v":""},{"$f":"IF(MA$11=\"\",\"\",VLOOKUP(WEEKDAY(DATE($A$7,$A$9+1-1,MA11),2),Auxiliar!$D$1:$E$7,2,0))","v":""},{"$f":"IF(MB$11=\"\",\"\",VLOOKUP(WEEKDAY(DATE($A$7,$A$9+1-1,MB11),2),Auxiliar!$D$1:$E$7,2,0))","v":""},{"$f":"IF(MC$11=\"\",\"\",VLOOKUP(WEEKDAY(DATE($A$7,$A$9+1-1,MC11),2),Auxiliar!$D$1:$E$7,2,0))","v":""},{"$f":"IF(MD$11=\"\",\"\",VLOOKUP(WEEKDAY(DATE($A$7,$A$9+1-1,MD11),2),Auxiliar!$D$1:$E$7,2,0))","v":""},{"$f":"IF(ME$11=\"\",\"\",VLOOKUP(WEEKDAY(DATE($A$7,$A$9+1-1,ME11),2),Auxiliar!$D$1:$E$7,2,0))","v":""},{"$f":"IF(MF$11=\"\",\"\",VLOOKUP(WEEKDAY(DATE($A$7,$A$9+1-1,MF11),2),Auxiliar!$D$1:$E$7,2,0))","v":""},{"$f":"IF(MG$11=\"\",\"\",VLOOKUP(WEEKDAY(DATE($A$7,$A$9+1-1,MG11),2),Auxiliar!$D$1:$E$7,2,0))","v":""},{"$f":"IF(MH$11=\"\",\"\",VLOOKUP(WEEKDAY(DATE($A$7,$A$9+1-1,MH11),2),Auxiliar!$D$1:$E$7,2,0))","v":""},{"$f":"IF(MI$11=\"\",\"\",VLOOKUP(WEEKDAY(DATE($A$7,$A$9+1-1,MI11),2),Auxiliar!$D$1:$E$7,2,0))","v":""},{"$f":"IF(MJ$11=\"\",\"\",VLOOKUP(WEEKDAY(DATE($A$7,$A$9+1-1,MJ11),2),Auxiliar!$D$1:$E$7,2,0))","v":""},{"$f":"IF(MK$11=\"\",\"\",VLOOKUP(WEEKDAY(DATE($A$7,$A$9+1-1,MK11),2),Auxiliar!$D$1:$E$7,2,0))","v":""},{"$f":"IF(ML$11=\"\",\"\",VLOOKUP(WEEKDAY(DATE($A$7,$A$9+1-1,ML11),2),Auxiliar!$D$1:$E$7,2,0))","v":""},{"$f":"IF(MM$11=\"\",\"\",VLOOKUP(WEEKDAY(DATE($A$7,$A$9+1-1,MM11),2),Auxiliar!$D$1:$E$7,2,0))","v":""},{"$f":"IF(MN$11=\"\",\"\",VLOOKUP(WEEKDAY(DATE($A$7,$A$9+1-1,MN11),2),Auxiliar!$D$1:$E$7,2,0))","v":""},{"$f":"IF(MO$11=\"\",\"\",VLOOKUP(WEEKDAY(DATE($A$7,$A$9+1-1,MO11),2),Auxiliar!$D$1:$E$7,2,0))","v":""},{"$f":"IF(MP$11=\"\",\"\",VLOOKUP(WEEKDAY(DATE($A$7,$A$9+1-1,MP11),2),Auxiliar!$D$1:$E$7,2,0))","v":""},{"$f":"IF(MQ$11=\"\",\"\",VLOOKUP(WEEKDAY(DATE($A$7,$A$9+1-1,MQ11),2),Auxiliar!$D$1:$E$7,2,0))","v":""},{"$f":"IF(MR$11=\"\",\"\",VLOOKUP(WEEKDAY(DATE($A$7,$A$9+1-1,MR11),2),Auxiliar!$D$1:$E$7,2,0))","v":""},{"$f":"IF(MS$11=\"\",\"\",VLOOKUP(WEEKDAY(DATE($A$7,$A$9+1-1,MS11),2),Auxiliar!$D$1:$E$7,2,0))","v":""},{"$f":"IF(MT$11=\"\",\"\",VLOOKUP(WEEKDAY(DATE($A$7,$A$9+1-1,MT11),2),Auxiliar!$D$1:$E$7,2,0))","v":""},{"$f":"IF(MU$11=\"\",\"\",VLOOKUP(WEEKDAY(DATE($A$7,$A$9+1-1,MU11),2),Auxiliar!$D$1:$E$7,2,0))","v":""},{"$f":"IF(MV$11=\"\",\"\",VLOOKUP(WEEKDAY(DATE($A$7,$A$9+1-1,MV11),2),Auxiliar!$D$1:$E$7,2,0))","v":""},{"$f":"IF(MW$11=\"\",\"\",VLOOKUP(WEEKDAY(DATE($A$7,$A$9+1-1,MW11),2),Auxiliar!$D$1:$E$7,2,0))","v":""},{"$f":"IF(MX$11=\"\",\"\",VLOOKUP(WEEKDAY(DATE($A$7,$A$9+1-1,MX11),2),Auxiliar!$D$1:$E$7,2,0))","v":""},{"$f":"IF(MY$11=\"\",\"\",VLOOKUP(WEEKDAY(DATE($A$7,$A$9+1-1,MY11),2),Auxiliar!$D$1:$E$7,2,0))","v":""},{"$f":"IF(MZ$11=\"\",\"\",VLOOKUP(WEEKDAY(DATE($A$7,$A$9+1-1,MZ11),2),Auxiliar!$D$1:$E$7,2,0))","v":""},{"$f":"IF(NA$11=\"\",\"\",VLOOKUP(WEEKDAY(DATE($A$7,$A$9+1-1,NA11),2),Auxiliar!$D$1:$E$7,2,0))","v":""},{"$f":"IF(NB$11=\"\",\"\",VLOOKUP(WEEKDAY(DATE($A$7,$A$9+1-1,NB11),2),Auxiliar!$D$1:$E$7,2,0))","v":""},{"$f":"IF(NC$11=\"\",\"\",VLOOKUP(WEEKDAY(DATE($A$7,$A$9+1-1,NC11),2),Auxiliar!$D$1:$E$7,2,0))","v":""},{"$f":"IF(ND$11=\"\",\"\",VLOOKUP(WEEKDAY(DATE($A$7,$A$9+1-1,ND11),2),Auxiliar!$D$1:$E$7,2,0))","v":""},{"$f":"IF(NE$11=\"\",\"\",VLOOKUP(WEEKDAY(DATE($A$7,$A$9+1-1,NE11),2),Auxiliar!$D$1:$E$7,2,0))","v":""},{"$f":"IF(NF$11=\"\",\"\",VLOOKUP(WEEKDAY(DATE($A$7,$A$9+1-1,NF11),2),Auxiliar!$D$1:$E$7,2,0))","v":""},{"$f":"IF(NG$11=\"\",\"\",VLOOKUP(WEEKDAY(DATE($A$7,$A$9+1-1,NG11),2),Auxiliar!$D$1:$E$7,2,0))","v":""},{"$f":"IF(NH$11=\"\",\"\",VLOOKUP(WEEKDAY(DATE($A$7,$A$9+1-1,NH11),2),Auxiliar!$D$1:$E$7,2,0))","v":""},{"$f":"IF(NI$11=\"\",\"\",VLOOKUP(WEEKDAY(DATE($A$7,$A$9+1-1,NI11),2),Auxiliar!$D$1:$E$7,2,0))","v":""},null,null,null,null,null,null,null,null,"E","V","M","T","MD"]
["López, Miguel",null,null,null,null,null,null,null,null,null,null,null,null,null,null,null,null,null,null,null,null,null,null,null,null,null,null,null,null,null,null,null,null,null,null,null,null,null,null,null,null,null,null,null,null,null,null,null,null,null,null,null,null,null,null,null,null,null,null,null,null,null,null,null,null,null,null,null,null,null,null,null,null,null,null,null,null,null,null,null,null,null,null,null,null,null,null,null,null,null,null,null,null,null,null,null,null,null,null,null,null,null,null,null,null,null,null,null,null,null,null,null,null,null,null,null,null,null,null,null,null,null,null,null,null,null,null,null,null,null,null,null,null,null,null,null,null,null,null,null,null,null,null,null,null,null,null,null,null,null,null,null,null,null,null,null,null,null,null,null,null,null,null,null,null,null,null,null,null,null,null,null,null,null,null,null,null,null,null,null,null,null,null,null,null,null,null,null,null,null,null,null,null,null,null,null,null,null,null,null,null,null,null,null,null,null,null,null,null,null,null,null,null,null,null,null,null,null,null,null,null,null,null,null,null,null,null,null,null,null,null,null,null,null,null,null,null,null,null,null,null,null,null,null,null,null,null,null,null,null,null,null,null,null,null,null,null,null,null,null,null,null,null,null,null,null,null,null,null,null,null,null,null,null,null,null,null,null,null,null,null,null,null,null,null,null,null,null,null,null,null,null,null,null,null,null,null,null,null,null,null,null,null,null,null,null,null,null,null,null,null,null,null,null,null,null,null,null,null,null,null,null,null,null,null,null,null,null,null,null,null,null,null,null,null,null,null,null,null,null,null,null,null,null,null,null,null,null,null,null,null,null,null,null,null,null,null,null,null,null,null,null,null,null,null,null,null,null,null,null,null,null,null,null,null,null,null,{"$f":"IF(SUMPRODUCT((OFFSET($A13,0,31*($A$9-1)+1,1,31)<>\"\")*(IF(OFFSET($A13,0,31*($A$9-1)+1,1,31)=$NL$9,0.5,1)*(OFFSET($A$9,0,31*($A$9-1)+1,1,31))))=0,\"\",SUMPRODUCT((OFFSET($A13,0,31*($A$9-1)+1,1,31)<>\"\")*(IF(OFFSET($A13,0,31*($A$9-1)+1,1,31)=$NL$9,0.5,1)*(OFFSET($A$9,0,31*($A$9-1)+1,1,31)))))","v":""},{"$f":"IF(SUMPRODUCT((OFFSET($A13,0,1,1,372)<>\"\")*(IF(OFFSET($A13,0,1,1,372)=$NL$9,0.5,1)*(OFFSET($A$9,0,1,1,372))))=0,\"\",SUMPRODUCT((OFFSET($A13,0,1,1,372)<>\"\")*(IF(OFFSET($A13,0,1,1,372)=$NL$9,0.5,1)*(OFFSET($A$9,0,1,1,372)))))","v":""},{"$f":"IFERROR(NK13+NL13-NO13,\"\")","v":""},null,{"$f":"IF(SUMPRODUCT((OFFSET($A13,0,1,1,372)<>\"\")*(OFFSET($A$9,0,1,1,372))*((OFFSET($A13,0,1,1,372))=NL$5))=0,\"\",SUMPRODUCT((OFFSET($A13,0,1,1,372)<>\"\")*(OFFSET($A$9,0,1,1,372))*((OFFSET($A13,0,1,1,372))=NL$5)))","v":""},{"$f":"IF(SUMPRODUCT((OFFSET($A13,0,1,1,372)<>\"\")*(OFFSET($A$9,0,1,1,372))*((OFFSET($A13,0,1,1,372))=NL$6))=0,\"\",SUMPRODUCT((OFFSET($A13,0,1,1,372)<>\"\")*(OFFSET($A$9,0,1,1,372))*((OFFSET($A13,0,1,1,372))=NL$6)))","v":""},{"$f":"IF(SUMPRODUCT((OFFSET($A13,0,1,1,372)<>\"\")*(OFFSET($A$9,0,1,1,372))*((OFFSET($A13,0,1,1,372))=NL$7))=0,\"\",SUMPRODUCT((OFFSET($A13,0,1,1,372)<>\"\")*(OFFSET($A$9,0,1,1,372))*((OFFSET($A13,0,1,1,372))=NL$7)))","v":""},{"$f":"IF(SUMPRODUCT((OFFSET($A13,0,1,1,372)<>\"\")*(OFFSET($A$9,0,1,1,372))*((OFFSET($A13,0,1,1,372))=NL$8))=0,\"\",SUMPRODUCT((OFFSET($A13,0,1,1,372)<>\"\")*(OFFSET($A$9,0,1,1,372))*((OFFSET($A13,0,1,1,372))=NL$8)))","v":""},{"$f":"IF(SUMPRODUCT((OFFSET($A13,0,1,1,372)<>\"\")*(OFFSET($A$9,0,1,1,372))*((OFFSET($A13,0,1,1,372))=NL$9))=0,\"\",SUMPRODUCT((OFFSET($A13,0,1,1,372)<>\"\")*(OFFSET($A$9,0,1,1,372))*((OFFSET($A13,0,1,1,372))=NL$9)))","v":""}]
["Rodríguez, Sol",null,null,null,null,null,null,null,null,null,null,null,null,null,null,null,null,null,null,null,null,null,null,null,null,null,null,null,null,null,null,null,null,null,null,null,null,null,null,null,null,null,null,null,null,null,null,null,null,null,null,null,null,null,null,null,null,null,null,null,null,null,null,null,null,null,null,null,null,null,null,null,null,null,null,null,null,null,null,null,null,null,null,null,null,null,null,null,null,null,null,null,null,null,null,null,null,null,null,null,null,null,null,null,null,null,null,null,null,null,null,null,null,null,null,null,null,null,null,null,null,null,null,null,null,null,null,null,null,null,null,null,null,null,null,null,null,null,null,null,null,null,null,null,null,null,null,null,null,null,null,null,null,null,null,null,null,null,null,null,null,null,null,null,null,null,null,null,null,null,null,null,null,null,null,null,null,null,null,null,null,null,null,null,null,null,null,null,null,null,null,null,null,null,null,null,null,null,null,null,null,null,null,null,null,null,null,null,null,null,null,null,null,null,null,null,null,null,null,null,null,null,null,null,null,null,null,null,null,null,null,null,null,null,null,null,null,null,null,null,null,null,null,null,null,null,null,null,null,null,null,null,null,null,null,null,null,null,null,null,null,null,null,null,null,null,null,null,null,null,null,null,null,null,null,null,null,null,null,null,null,null,null,null,null,null,null,null,null,null,null,null,null,null,null,null,null,null,null,null,null,null,null,null,null,null,null,null,null,null,null,null,null,null,null,null,null,null,null,null,null,null,null,null,null,null,null,null,null,null,null,null,null,null,null,null,null,null,null,null,null,null,null,null,null,null,null,null,null,null,null,null,null,null,null,null,null,null,null,null,null,null,null,null,null,null,null,null,null,null,null,null,null,null,null,null,null,{"$f":"IF(SUMPRODUCT((OFFSET($A14,0,31*($A$9-1)+1,1,31)<>\"\")*(IF(OFFSET($A14,0,31*($A$9-1)+1,1,31)=$NL$9,0.5,1)*(OFFSET($A$9,0,31*($A$9-1)+1,1,31))))=0,\"\",SUMPRODUCT((OFFSET($A14,0,31*($A$9-1)+1,1,31)<>\"\")*(IF(OFFSET($A14,0,31*($A$9-1)+1,1,31)=$NL$9,0.5,1)*(OFFSET($A$9,0,31*($A$9-1)+1,1,31)))))","v":""},{"$f":"IF(SUMPRODUCT((OFFSET($A14,0,1,1,372)<>\"\")*(IF(OFFSET($A14,0,1,1,372)=$NL$9,0.5,1)*(OFFSET($A$9,0,1,1,372))))=0,\"\",SUMPRODUCT((OFFSET($A14,0,1,1,372)<>\"\")*(IF(OFFSET($A14,0,1,1,372)=$NL$9,0.5,1)*(OFFSET($A$9,0,1,1,372)))))","v":""},{"$f":"IFERROR(NK14+NL14-NO14,\"\")","v":""},null,{"$f":"IF(SUMPRODUCT((OFFSET($A14,0,1,1,372)<>\"\")*(OFFSET($A$9,0,1,1,372))*((OFFSET($A14,0,1,1,372))=NL$5))=0,\"\",SUMPRODUCT((OFFSET($A14,0,1,1,372)<>\"\")*(OFFSET($A$9,0,1,1,372))*((OFFSET($A14,0,1,1,372))=NL$5)))","v":""},{"$f":"IF(SUMPRODUCT((OFFSET($A14,0,1,1,372)<>\"\")*(OFFSET($A$9,0,1,1,372))*((OFFSET($A14,0,1,1,372))=NL$6))=0,\"\",SUMPRODUCT((OFFSET($A14,0,1,1,372)<>\"\")*(OFFSET($A$9,0,1,1,372))*((OFFSET($A14,0,1,1,372))=NL$6)))","v":""},{"$f":"IF(SUMPRODUCT((OFFSET($A14,0,1,1,372)<>\"\")*(OFFSET($A$9,0,1,1,372))*((OFFSET($A14,0,1,1,372))=NL$7))=0,\"\",SUMPRODUCT((OFFSET($A14,0,1,1,372)<>\"\")*(OFFSET($A$9,0,1,1,372))*((OFFSET($A14,0,1,1,372))=NL$7)))","v":""},{"$f":"IF(SUMPRODUCT((OFFSET($A14,0,1,1,372)<>\"\")*(OFFSET($A$9,0,1,1,372))*((OFFSET($A14,0,1,1,372))=NL$8))=0,\"\",SUMPRODUCT((OFFSET($A14,0,1,1,372)<>\"\")*(OFFSET($A$9,0,1,1,372))*((OFFSET($A14,0,1,1,372))=NL$8)))","v":""},{"$f":"IF(SUMPRODUCT((OFFSET($A14,0,1,1,372)<>\"\")*(OFFSET($A$9,0,1,1,372))*((OFFSET($A14,0,1,1,372))=NL$9))=0,\"\",SUMPRODUCT((OFFSET($A14,0,1,1,372)<>\"\")*(OFFSET($A$9,0,1,1,372))*((OFFSET($A14,0,1,1,372))=NL$9)))","v":""}]
["Márquez, Juan",null,null,null,null,null,null,null,null,null,null,null,null,null,null,null,null,null,null,null,null,null,null,null,null,null,null,null,null,null,null,null,null,null,null,null,null,null,null,null,null,null,null,null,null,null,null,null,null,null,null,null,null,null,null,null,null,null,null,null,null,null,null,null,null,null,null,null,null,null,null,null,null,null,null,null,null,null,null,null,null,null,null,null,null,null,null,null,null,null,null,null,null,null,null,null,null,null,null,null,null,null,null,null,null,null,null,null,null,null,null,null,null,null,null,null,null,null,null,null,null,null,null,null,null,null,null,null,null,null,null,null,null,null,null,null,null,null,null,null,null,null,null,null,null,null,null,null,null,null,null,null,null,null,null,null,null,null,null,null,null,null,null,null,null,null,null,null,null,null,null,null,null,null,null,null,null,null,null,null,null,null,null,null,null,null,null,null,null,null,null,null,null,null,null,null,null,null,null,null,null,null,null,null,null,null,null,null,null,null,null,null,null,null,null,null,null,null,null,null,null,null,null,null,null,null,null,null,null,null,null,null,null,null,null,null,null,null,null,null,null,null,null,null,null,null,null,null,null,null,null,null,null,null,null,null,null,null,null,null,null,null,null,null,null,null,null,null,null,null,null,null,null,null,null,null,null,null,null,null,null,null,null,null,null,null,null,null,null,null,null,null,null,null,null,null,null,null,null,null,null,null,null,null,null,null,null,null,null,null,null,null,null,null,null,null,null,null,null,null,null,null,null,null,null,null,null,null,null,null,null,null,null,null,null,null,null,null,null,null,null,null,null,null,null,null,null,null,null,null,null,null,null,null,null,null,null,null,null,null,null,null,null,null,null,null,null,null,null,null,null,null,null,null,null,null,null,{"$f":"IF(SUMPRODUCT((OFFSET($A15,0,31*($A$9-1)+1,1,31)<>\"\")*(IF(OFFSET($A15,0,31*($A$9-1)+1,1,31)=$NL$9,0.5,1)*(OFFSET($A$9,0,31*($A$9-1)+1,1,31))))=0,\"\",SUMPRODUCT((OFFSET($A15,0,31*($A$9-1)+1,1,31)<>\"\")*(IF(OFFSET($A15,0,31*($A$9-1)+1,1,31)=$NL$9,0.5,1)*(OFFSET($A$9,0,31*($A$9-1)+1,1,31)))))","v":""},{"$f":"IF(SUMPRODUCT((OFFSET($A15,0,1,1,372)<>\"\")*(IF(OFFSET($A15,0,1,1,372)=$NL$9,0.5,1)*(OFFSET($A$9,0,1,1,372))))=0,\"\",SUMPRODUCT((OFFSET($A15,0,1,1,372)<>\"\")*(IF(OFFSET($A15,0,1,1,372)=$NL$9,0.5,1)*(OFFSET($A$9,0,1,1,372)))))","v":""},"",null,{"$f":"IF(SUMPRODUCT((OFFSET($A15,0,1,1,372)<>\"\")*(OFFSET($A$9,0,1,1,372))*((OFFSET($A15,0,1,1,372))=NL$5))=0,\"\",SUMPRODUCT((OFFSET($A15,0,1,1,372)<>\"\")*(OFFSET($A$9,0,1,1,372))*((OFFSET($A15,0,1,1,372))=NL$5)))","v":""},{"$f":"IF(SUMPRODUCT((OFFSET($A15,0,1,1,372)<>\"\")*(OFFSET($A$9,0,1,1,372))*((OFFSET($A15,0,1,1,372))=NL$6))=0,\"\",SUMPRODUCT((OFFSET($A15,0,1,1,372)<>\"\")*(OFFSET($A$9,0,1,1,372))*((OFFSET($A15,0,1,1,372))=NL$6)))","v":""},{"$f":"IF(SUMPRODUCT((OFFSET($A15,0,1,1,372)<>\"\")*(OFFSET($A$9,0,1,1,372))*((OFFSET($A15,0,1,1,372))=NL$7))=0,\"\",SUMPRODUCT((OFFSET($A15,0,1,1,372)<>\"\")*(OFFSET($A$9,0,1,1,372))*((OFFSET($A15,0,1,1,372))=NL$7)))","v":""},{"$f":"IF(SUMPRODUCT((OFFSET($A15,0,1,1,372)<>\"\")*(OFFSET($A$9,0,1,1,372))*((OFFSET($A15,0,1,1,372))=NL$8))=0,\"\",SUMPRODUCT((OFFSET($A15,0,1,1,372)<>\"\")*(OFFSET($A$9,0,1,1,372))*((OFFSET($A15,0,1,1,372))=NL$8)))","v":""},{"$f":"IF(SUMPRODUCT((OFFSET($A15,0,1,1,372)<>\"\")*(OFFSET($A$9,0,1,1,372))*((OFFSET($A15,0,1,1,372))=NL$9))=0,\"\",SUMPRODUCT((OFFSET($A15,0,1,1,372)<>\"\")*(OFFSET($A$9,0,1,1,372))*((OFFSET($A15,0,1,1,372))=NL$9)))","v":""}]
["Soler, Víctor",null,null,null,null,null,null,null,null,null,null,null,null,null,null,null,null,null,null,null,null,null,null,null,null,null,null,null,null,null,null,null,null,null,null,null,null,null,null,null,null,null,null,null,null,null,null,null,null,null,null,null,null,null,null,null,null,null,null,null,null,null,null,null,null,null,null,null,null,null,null,null,null,null,null,null,null,null,null,null,null,null,null,null,null,null,null,null,null,null,null,null,null,null,null,null,null,null,null,null,null,null,null,null,null,null,null,null,null,null,null,null,null,null,null,null,null,null,null,null,null,null,null,null,null,null,null,null,null,null,null,null,null,null,null,null,null,null,null,null,null,null,null,null,null,null,null,null,null,null,null,null,null,null,null,null,null,null,null,null,null,null,null,null,null,null,null,null,null,null,null,null,null,null,null,null,null,null,null,null,null,null,null,null,null,null,null,null,null,null,null,null,null,null,null,null,null,null,null,null,null,null,null,null,null,null,null,null,null,null,null,null,null,null,null,null,null,null,null,null,null,null,null,null,null,null,null,null,null,null,null,null,null,null,null,null,null,null,null,null,null,null,null,null,null,null,null,null,null,null,null,null,null,null,null,null,null,null,null,null,null,null,null,null,null,null,null,null,null,null,null,null,null,null,null,null,null,null,null,null,null,null,null,null,null,null,null,null,null,null,null,null,null,null,null,null,null,null,null,null,null,null,null,null,null,null,null,null,null,null,null,null,null,null,null,null,null,null,null,null,null,null,null,null,null,null,null,null,null,null,null,null,null,null,null,null,null,null,null,null,null,null,null,null,null,null,null,null,null,null,null,null,null,null,null,null,null,null,null,null,null,null,null,null,null,null,null,null,null,null,null,null,null,null,null,null,null,{"$f":"IF(SUMPRODUCT((OFFSET($A16,0,31*($A$9-1)+1,1,31)<>\"\")*(IF(OFFSET($A16,0,31*($A$9-1)+1,1,31)=$NL$9,0.5,1)*(OFFSET($A$9,0,31*($A$9-1)+1,1,31))))=0,\"\",SUMPRODUCT((OFFSET($A16,0,31*($A$9-1)+1,1,31)<>\"\")*(IF(OFFSET($A16,0,31*($A$9-1)+1,1,31)=$NL$9,0.5,1)*(OFFSET($A$9,0,31*($A$9-1)+1,1,31)))))","v":""},{"$f":"IF(SUMPRODUCT((OFFSET($A16,0,1,1,372)<>\"\")*(IF(OFFSET($A16,0,1,1,372)=$NL$9,0.5,1)*(OFFSET($A$9,0,1,1,372))))=0,\"\",SUMPRODUCT((OFFSET($A16,0,1,1,372)<>\"\")*(IF(OFFSET($A16,0,1,1,372)=$NL$9,0.5,1)*(OFFSET($A$9,0,1,1,372)))))","v":""},"",null,{"$f":"IF(SUMPRODUCT((OFFSET($A16,0,1,1,372)<>\"\")*(OFFSET($A$9,0,1,1,372))*((OFFSET($A16,0,1,1,372))=NL$5))=0,\"\",SUMPRODUCT((OFFSET($A16,0,1,1,372)<>\"\")*(OFFSET($A$9,0,1,1,372))*((OFFSET($A16,0,1,1,372))=NL$5)))","v":""},{"$f":"IF(SUMPRODUCT((OFFSET($A16,0,1,1,372)<>\"\")*(OFFSET($A$9,0,1,1,372))*((OFFSET($A16,0,1,1,372))=NL$6))=0,\"\",SUMPRODUCT((OFFSET($A16,0,1,1,372)<>\"\")*(OFFSET($A$9,0,1,1,372))*((OFFSET($A16,0,1,1,372))=NL$6)))","v":""},{"$f":"IF(SUMPRODUCT((OFFSET($A16,0,1,1,372)<>\"\")*(OFFSET($A$9,0,1,1,372))*((OFFSET($A16,0,1,1,372))=NL$7))=0,\"\",SUMPRODUCT((OFFSET($A16,0,1,1,372)<>\"\")*(OFFSET($A$9,0,1,1,372))*((OFFSET($A16,0,1,1,372))=NL$7)))","v":""},{"$f":"IF(SUMPRODUCT((OFFSET($A16,0,1,1,372)<>\"\")*(OFFSET($A$9,0,1,1,372))*((OFFSET($A16,0,1,1,372))=NL$8))=0,\"\",SUMPRODUCT((OFFSET($A16,0,1,1,372)<>\"\")*(OFFSET($A$9,0,1,1,372))*((OFFSET($A16,0,1,1,372))=NL$8)))","v":""},{"$f":"IF(SUMPRODUCT((OFFSET($A16,0,1,1,372)<>\"\")*(OFFSET($A$9,0,1,1,372))*((OFFSET($A16,0,1,1,372))=NL$9))=0,\"\",SUMPRODUCT((OFFSET($A16,0,1,1,372)<>\"\")*(OFFSET($A$9,0,1,1,372))*((OFFSET($A16,0,1,1,372))=NL$9)))","v":""}]
["Lim, Ana",null,null,null,null,null,null,null,null,null,null,null,null,null,null,null,null,null,null,null,null,null,null,null,null,null,null,null,null,null,null,null,null,null,null,null,null,null,null,null,null,null,null,null,null,null,null,null,null,null,null,null,null,null,null,null,null,null,null,null,null,null,null,null,null,null,null,null,null,null,null,null,null,null,null,null,null,null,null,null,null,null,null,null,null,null,null,null,null,null,null,null,null,null,null,null,null,null,null,null,null,null,null,null,null,null,null,null,null,null,null,null,null,null,null,null,null,null,null,null,null,null,null,null,null,null,null,null,null,null,null,null,null,null,null,null,null,null,null,null,null,null,null,null,null,null,null,null,null,null,null,null,null,null,null,null,null,null,null,null,null,null,null,null,null,null,null,null,null,null,null,null,null,null,null,null,null,null,null,null,null,null,null,null,null,null,null,null,null,null,null,null,null,null,null,null,null,null,null,null,null,null,null,null,null,null,null,null,null,null,null,null,null,null,null,null,null,null,null,null,null,null,null,null,null,null,null,null,null,null,null,null,null,null,null,null,null,null,null,null,null,null,null,null,null,null,null,null,null,null,null,null,null,null,null,null,null,null,null,null,null,null,null,null,null,null,null,null,null,null,null,null,null,null,null,null,null,null,null,null,null,null,null,null,null,null,null,null,null,null,null,null,null,null,null,null,null,null,null,null,null,null,null,null,null,null,null,null,null,null,null,null,null,null,null,null,null,null,null,null,null,null,null,null,null,null,null,null,null,null,null,null,null,null,null,null,null,null,null,null,null,null,null,null,null,null,null,null,null,null,null,null,null,null,null,null,null,null,null,null,null,null,null,null,null,null,null,null,null,null,null,null,null,null,null,null,null,{"$f":"IF(SUMPRODUCT((OFFSET($A17,0,31*($A$9-1)+1,1,31)<>\"\")*(IF(OFFSET($A17,0,31*($A$9-1)+1,1,31)=$NL$9,0.5,1)*(OFFSET($A$9,0,31*($A$9-1)+1,1,31))))=0,\"\",SUMPRODUCT((OFFSET($A17,0,31*($A$9-1)+1,1,31)<>\"\")*(IF(OFFSET($A17,0,31*($A$9-1)+1,1,31)=$NL$9,0.5,1)*(OFFSET($A$9,0,31*($A$9-1)+1,1,31)))))","v":""},{"$f":"IF(SUMPRODUCT((OFFSET($A17,0,1,1,372)<>\"\")*(IF(OFFSET($A17,0,1,1,372)=$NL$9,0.5,1)*(OFFSET($A$9,0,1,1,372))))=0,\"\",SUMPRODUCT((OFFSET($A17,0,1,1,372)<>\"\")*(IF(OFFSET($A17,0,1,1,372)=$NL$9,0.5,1)*(OFFSET($A$9,0,1,1,372)))))","v":""},"",null,{"$f":"IF(SUMPRODUCT((OFFSET($A17,0,1,1,372)<>\"\")*(OFFSET($A$9,0,1,1,372))*((OFFSET($A17,0,1,1,372))=NL$5))=0,\"\",SUMPRODUCT((OFFSET($A17,0,1,1,372)<>\"\")*(OFFSET($A$9,0,1,1,372))*((OFFSET($A17,0,1,1,372))=NL$5)))","v":""},{"$f":"IF(SUMPRODUCT((OFFSET($A17,0,1,1,372)<>\"\")*(OFFSET($A$9,0,1,1,372))*((OFFSET($A17,0,1,1,372))=NL$6))=0,\"\",SUMPRODUCT((OFFSET($A17,0,1,1,372)<>\"\")*(OFFSET($A$9,0,1,1,372))*((OFFSET($A17,0,1,1,372))=NL$6)))","v":""},{"$f":"IF(SUMPRODUCT((OFFSET($A17,0,1,1,372)<>\"\")*(OFFSET($A$9,0,1,1,372))*((OFFSET($A17,0,1,1,372))=NL$7))=0,\"\",SUMPRODUCT((OFFSET($A17,0,1,1,372)<>\"\")*(OFFSET($A$9,0,1,1,372))*((OFFSET($A17,0,1,1,372))=NL$7)))","v":""},{"$f":"IF(SUMPRODUCT((OFFSET($A17,0,1,1,372)<>\"\")*(OFFSET($A$9,0,1,1,372))*((OFFSET($A17,0,1,1,372))=NL$8))=0,\"\",SUMPRODUCT((OFFSET($A17,0,1,1,372)<>\"\")*(OFFSET($A$9,0,1,1,372))*((OFFSET($A17,0,1,1,372))=NL$8)))","v":""},{"$f":"IF(SUMPRODUCT((OFFSET($A17,0,1,1,372)<>\"\")*(OFFSET($A$9,0,1,1,372))*((OFFSET($A17,0,1,1,372))=NL$9))=0,\"\",SUMPRODUCT((OFFSET($A17,0,1,1,372)<>\"\")*(OFFSET($A$9,0,1,1,372))*((OFFSET($A17,0,1,1,372))=NL$9)))","v":""}]
["Biel, María",null,null,null,null,null,null,null,null,null,null,null,null,null,null,null,null,null,null,null,null,null,null,null,null,null,null,null,null,null,null,null,null,null,null,null,null,null,null,null,null,null,null,null,null,null,null,null,null,null,null,null,null,null,null,null,null,null,null,null,null,null,null,null,null,null,null,null,null,null,null,null,null,null,null,null,null,null,null,null,null,null,null,null,null,null,null,null,null,null,null,null,null,null,null,null,null,null,null,null,null,null,null,null,null,null,null,null,null,null,null,null,null,null,null,null,null,null,null,null,null,null,null,null,null,null,null,null,null,null,null,null,null,null,null,null,null,null,null,null,null,null,null,null,null,null,null,null,null,null,null,null,null,null,null,null,null,null,null,null,null,null,null,null,null,null,null,null,null,null,null,null,null,null,null,null,null,null,null,null,null,null,null,null,null,null,null,null,null,null,null,null,null,null,null,null,null,null,null,null,null,null,null,null,null,null,null,null,null,null,null,null,null,null,null,null,null,null,null,null,null,null,null,null,null,null,null,null,null,null,null,null,null,null,null,null,null,null,null,null,null,null,null,null,null,null,null,null,null,null,null,null,null,null,null,null,null,null,null,null,null,null,null,null,null,null,null,null,null,null,null,null,null,null,null,null,null,null,null,null,null,null,null,null,null,null,null,null,null,null,null,null,null,null,null,null,null,null,null,null,null,null,null,null,null,null,null,null,null,null,null,null,null,null,null,null,null,null,null,null,null,null,null,null,null,null,null,null,null,null,null,null,null,null,null,null,null,null,null,null,null,null,null,null,null,null,null,null,null,null,null,null,null,null,null,null,null,null,null,null,null,null,null,null,null,null,null,null,null,null,null,null,null,null,null,null,null,{"$f":"IF(SUMPRODUCT((OFFSET($A18,0,31*($A$9-1)+1,1,31)<>\"\")*(IF(OFFSET($A18,0,31*($A$9-1)+1,1,31)=$NL$9,0.5,1)*(OFFSET($A$9,0,31*($A$9-1)+1,1,31))))=0,\"\",SUMPRODUCT((OFFSET($A18,0,31*($A$9-1)+1,1,31)<>\"\")*(IF(OFFSET($A18,0,31*($A$9-1)+1,1,31)=$NL$9,0.5,1)*(OFFSET($A$9,0,31*($A$9-1)+1,1,31)))))","v":""},{"$f":"IF(SUMPRODUCT((OFFSET($A18,0,1,1,372)<>\"\")*(IF(OFFSET($A18,0,1,1,372)=$NL$9,0.5,1)*(OFFSET($A$9,0,1,1,372))))=0,\"\",SUMPRODUCT((OFFSET($A18,0,1,1,372)<>\"\")*(IF(OFFSET($A18,0,1,1,372)=$NL$9,0.5,1)*(OFFSET($A$9,0,1,1,372)))))","v":""},"",null,{"$f":"IF(SUMPRODUCT((OFFSET($A18,0,1,1,372)<>\"\")*(OFFSET($A$9,0,1,1,372))*((OFFSET($A18,0,1,1,372))=NL$5))=0,\"\",SUMPRODUCT((OFFSET($A18,0,1,1,372)<>\"\")*(OFFSET($A$9,0,1,1,372))*((OFFSET($A18,0,1,1,372))=NL$5)))","v":""},{"$f":"IF(SUMPRODUCT((OFFSET($A18,0,1,1,372)<>\"\")*(OFFSET($A$9,0,1,1,372))*((OFFSET($A18,0,1,1,372))=NL$6))=0,\"\",SUMPRODUCT((OFFSET($A18,0,1,1,372)<>\"\")*(OFFSET($A$9,0,1,1,372))*((OFFSET($A18,0,1,1,372))=NL$6)))","v":""},{"$f":"IF(SUMPRODUCT((OFFSET($A18,0,1,1,372)<>\"\")*(OFFSET($A$9,0,1,1,372))*((OFFSET($A18,0,1,1,372))=NL$7))=0,\"\",SUMPRODUCT((OFFSET($A18,0,1,1,372)<>\"\")*(OFFSET($A$9,0,1,1,372))*((OFFSET($A18,0,1,1,372))=NL$7)))","v":""},{"$f":"IF(SUMPRODUCT((OFFSET($A18,0,1,1,372)<>\"\")*(OFFSET($A$9,0,1,1,372))*((OFFSET($A18,0,1,1,372))=NL$8))=0,\"\",SUMPRODUCT((OFFSET($A18,0,1,1,372)<>\"\")*(OFFSET($A$9,0,1,1,372))*((OFFSET($A18,0,1,1,372))=NL$8)))","v":""},{"$f":"IF(SUMPRODUCT((OFFSET($A18,0,1,1,372)<>\"\")*(OFFSET($A$9,0,1,1,372))*((OFFSET($A18,0,1,1,372))=NL$9))=0,\"\",SUMPRODUCT((OFFSET($A18,0,1,1,372)<>\"\")*(OFFSET($A$9,0,1,1,372))*((OFFSET($A18,0,1,1,372))=NL$9)))","v":""}]
["Car, Ciro",null,null,null,null,null,null,null,null,null,null,null,null,null,null,null,null,null,null,null,null,null,null,null,null,null,null,null,null,null,null,null,null,null,null,null,null,null,null,null,null,null,null,null,null,null,null,null,null,null,null,null,null,null,null,null,null,null,null,null,null,null,null,null,null,null,null,null,null,null,null,null,null,null,null,null,null,null,null,null,null,null,null,null,null,null,null,null,null,null,null,null,null,null,null,null,null,null,null,null,null,null,null,null,null,null,null,null,null,null,null,null,null,null,null,null,null,null,null,null,null,null,null,null,null,null,null,null,null,null,null,null,null,null,null,null,null,null,null,null,null,null,null,null,null,null,null,null,null,null,null,null,null,null,null,null,null,null,null,null,null,null,null,null,null,null,null,null,null,null,null,null,null,null,null,null,null,null,null,null,null,null,null,null,null,null,null,null,null,null,null,null,null,null,null,null,null,null,null,null,null,null,null,null,null,null,null,null,null,null,null,null,null,null,null,null,null,null,null,null,null,null,null,null,null,null,null,null,null,null,null,null,null,null,null,null,null,null,null,null,null,null,null,null,null,null,null,null,null,null,null,null,null,null,null,null,null,null,null,null,null,null,null,null,null,null,null,null,null,null,null,null,null,null,null,null,null,null,null,null,null,null,null,null,null,null,null,null,null,null,null,null,null,null,null,null,null,null,null,null,null,null,null,null,null,null,null,null,null,null,null,null,null,null,null,null,null,null,null,null,null,null,null,null,null,null,null,null,null,null,null,null,null,null,null,null,null,null,null,null,null,null,null,null,null,null,null,null,null,null,null,null,null,null,null,null,null,null,null,null,null,null,null,null,null,null,null,null,null,null,null,null,null,null,null,null,null,{"$f":"IF(SUMPRODUCT((OFFSET($A19,0,31*($A$9-1)+1,1,31)<>\"\")*(IF(OFFSET($A19,0,31*($A$9-1)+1,1,31)=$NL$9,0.5,1)*(OFFSET($A$9,0,31*($A$9-1)+1,1,31))))=0,\"\",SUMPRODUCT((OFFSET($A19,0,31*($A$9-1)+1,1,31)<>\"\")*(IF(OFFSET($A19,0,31*($A$9-1)+1,1,31)=$NL$9,0.5,1)*(OFFSET($A$9,0,31*($A$9-1)+1,1,31)))))","v":""},{"$f":"IF(SUMPRODUCT((OFFSET($A19,0,1,1,372)<>\"\")*(IF(OFFSET($A19,0,1,1,372)=$NL$9,0.5,1)*(OFFSET($A$9,0,1,1,372))))=0,\"\",SUMPRODUCT((OFFSET($A19,0,1,1,372)<>\"\")*(IF(OFFSET($A19,0,1,1,372)=$NL$9,0.5,1)*(OFFSET($A$9,0,1,1,372)))))","v":""},"",null,{"$f":"IF(SUMPRODUCT((OFFSET($A19,0,1,1,372)<>\"\")*(OFFSET($A$9,0,1,1,372))*((OFFSET($A19,0,1,1,372))=NL$5))=0,\"\",SUMPRODUCT((OFFSET($A19,0,1,1,372)<>\"\")*(OFFSET($A$9,0,1,1,372))*((OFFSET($A19,0,1,1,372))=NL$5)))","v":""},{"$f":"IF(SUMPRODUCT((OFFSET($A19,0,1,1,372)<>\"\")*(OFFSET($A$9,0,1,1,372))*((OFFSET($A19,0,1,1,372))=NL$6))=0,\"\",SUMPRODUCT((OFFSET($A19,0,1,1,372)<>\"\")*(OFFSET($A$9,0,1,1,372))*((OFFSET($A19,0,1,1,372))=NL$6)))","v":""},{"$f":"IF(SUMPRODUCT((OFFSET($A19,0,1,1,372)<>\"\")*(OFFSET($A$9,0,1,1,372))*((OFFSET($A19,0,1,1,372))=NL$7))=0,\"\",SUMPRODUCT((OFFSET($A19,0,1,1,372)<>\"\")*(OFFSET($A$9,0,1,1,372))*((OFFSET($A19,0,1,1,372))=NL$7)))","v":""},{"$f":"IF(SUMPRODUCT((OFFSET($A19,0,1,1,372)<>\"\")*(OFFSET($A$9,0,1,1,372))*((OFFSET($A19,0,1,1,372))=NL$8))=0,\"\",SUMPRODUCT((OFFSET($A19,0,1,1,372)<>\"\")*(OFFSET($A$9,0,1,1,372))*((OFFSET($A19,0,1,1,372))=NL$8)))","v":""},{"$f":"IF(SUMPRODUCT((OFFSET($A19,0,1,1,372)<>\"\")*(OFFSET($A$9,0,1,1,372))*((OFFSET($A19,0,1,1,372))=NL$9))=0,\"\",SUMPRODUCT((OFFSET($A19,0,1,1,372)<>\"\")*(OFFSET($A$9,0,1,1,372))*((OFFSET($A19,0,1,1,372))=NL$9)))","v":""}]
[null,null,null,null,null,null,null,null,null,null,null,null,null,null,null,null,null,null,null,null,null,null,null,null,null,null,null,null,null,null,null,null,null,null,null,null,null,null,null,null,null,null,null,null,null,null,null,null,null,null,null,null,null,null,null,null,null,null,null,null,null,null,null,null,null,null,null,null,null,null,null,null,null,null,null,null,null,null,null,null,null,null,null,null,null,null,null,null,null,null,null,null,null,null,null,null,null,null,null,null,null,null,null,null,null,null,null,null,null,null,null,null,null,null,null,null,null,null,null,null,null,null,null,null,null,null,null,null,null,null,null,null,null,null,null,null,null,null,null,null,null,null,null,null,null,null,null,null,null,null,null,null,null,null,null,null,null,null,null,null,null,null,null,null,null,null,null,null,null,null,null,null,null,null,null,null,null,null,null,null,null,null,null,null,null,null,null,null,null,null,null,null,null,null,null,null,null,null,null,null,null,null,null,null,null,null,null,null,null,null,null,null,null,null,null,null,null,null,null,null,null,null,null,null,null,null,null,null,null,null,null,null,null,null,null,null,null,null,null,null,null,null,null,null,null,null,null,null,null,null,null,null,null,null,null,null,null,null,null,null,null,null,null,null,null,null,null,null,null,null,null,null,null,null,null,null,null,null,null,null,null,null,null,null,null,null,null,null,null,null,null,null,null,null,null,null,null,null,null,null,null,null,null,null,null,null,null,null,null,null,null,null,null,null,null,null,null,null,null,null,null,null,null,null,null,null,null,null,null,null,null,null,null,null,null,null,null,null,null,null,null,null,null,null,null,null,null,null,null,null,null,null,null,null,null,null,null,null,null,null,null,null,null,null,null,null,null,null,null,null,null,null,null,null,null,null,null,{"$f":"IF(SUMPRODUCT((OFFSET($A20,0,31*($A$9-1)+1,1,31)<>\"\")*(IF(OFFSET($A20,0,31*($A$9-1)+1,1,31)=$NL$9,0.5,1)*(OFFSET($A$9,0,31*($A$9-1)+1,1,31))))=0,\"\",SUMPRODUCT((OFFSET($A20,0,31*($A$9-1)+1,1,31)<>\"\")*(IF(OFFSET($A20,0,31*($A$9-1)+1,1,31)=$NL$9,0.5,1)*(OFFSET($A$9,0,31*($A$9-1)+1,1,31)))))","v":""},{"$f":"IF(SUMPRODUCT((OFFSET($A20,0,1,1,372)<>\"\")*(IF(OFFSET($A20,0,1,1,372)=$NL$9,0.5,1)*(OFFSET($A$9,0,1,1,372))))=0,\"\",SUMPRODUCT((OFFSET($A20,0,1,1,372)<>\"\")*(IF(OFFSET($A20,0,1,1,372)=$NL$9,0.5,1)*(OFFSET($A$9,0,1,1,372)))))","v":""},"",null,{"$f":"IF(SUMPRODUCT((OFFSET($A20,0,1,1,372)<>\"\")*(OFFSET($A$9,0,1,1,372))*((OFFSET($A20,0,1,1,372))=NL$5))=0,\"\",SUMPRODUCT((OFFSET($A20,0,1,1,372)<>\"\")*(OFFSET($A$9,0,1,1,372))*((OFFSET($A20,0,1,1,372))=NL$5)))","v":""},{"$f":"IF(SUMPRODUCT((OFFSET($A20,0,1,1,372)<>\"\")*(OFFSET($A$9,0,1,1,372))*((OFFSET($A20,0,1,1,372))=NL$6))=0,\"\",SUMPRODUCT((OFFSET($A20,0,1,1,372)<>\"\")*(OFFSET($A$9,0,1,1,372))*((OFFSET($A20,0,1,1,372))=NL$6)))","v":""},{"$f":"IF(SUMPRODUCT((OFFSET($A20,0,1,1,372)<>\"\")*(OFFSET($A$9,0,1,1,372))*((OFFSET($A20,0,1,1,372))=NL$7))=0,\"\",SUMPRODUCT((OFFSET($A20,0,1,1,372)<>\"\")*(OFFSET($A$9,0,1,1,372))*((OFFSET($A20,0,1,1,372))=NL$7)))","v":""},{"$f":"IF(SUMPRODUCT((OFFSET($A20,0,1,1,372)<>\"\")*(OFFSET($A$9,0,1,1,372))*((OFFSET($A20,0,1,1,372))=NL$8))=0,\"\",SUMPRODUCT((OFFSET($A20,0,1,1,372)<>\"\")*(OFFSET($A$9,0,1,1,372))*((OFFSET($A20,0,1,1,372))=NL$8)))","v":""},{"$f":"IF(SUMPRODUCT((OFFSET($A20,0,1,1,372)<>\"\")*(OFFSET($A$9,0,1,1,372))*((OFFSET($A20,0,1,1,372))=NL$9))=0,\"\",SUMPRODUCT((OFFSET($A20,0,1,1,372)<>\"\")*(OFFSET($A$9,0,1,1,372))*((OFFSET($A20,0,1,1,372))=NL$9)))","v":""}]
[null,null,null,null,null,null,null,null,null,null,null,null,null,null,null,null,null,null,null,null,null,null,null,null,null,null,null,null,null,null,null,null,null,null,null,null,null,null,null,null,null,null,null,null,null,null,null,null,null,null,null,null,null,null,null,null,null,null,null,null,null,null,null,null,null,null,null,null,null,null,null,null,null,null,null,null,null,null,null,null,null,null,null,null,null,null,null,null,null,null,null,null,null,null,null,null,null,null,null,null,null,null,null,null,null,null,null,null,null,null,null,null,null,null,null,null,null,null,null,null,null,null,null,null,null,null,null,null,null,null,null,null,null,null,null,null,null,null,null,null,null,null,null,null,null,null,null,null,null,null,null,null,null,null,null,null,null,null,null,null,null,null,null,null,null,null,null,null,null,null,null,null,null,null,null,null,null,null,null,null,null,null,null,null,null,null,null,null,null,null,null,null,null,null,null,null,null,null,null,null,null,null,null,null,null,null,null,null,null,null,null,null,null,null,null,null,null,null,null,null,null,null,null,null,null,null,null,null,null,null,null,null,null,null,null,null,null,null,null,null,null,null,null,null,null,null,null,null,null,null,null,null,null,null,null,null,null,null,null,null,null,null,null,null,null,null,null,null,null,null,null,null,null,null,null,null,null,null,null,null,null,null,null,null,null,null,null,null,null,null,null,null,null,null,null,null,null,null,null,null,null,null,null,null,null,null,null,null,null,null,null,null,null,null,null,null,null,null,null,null,null,null,null,null,null,null,null,null,null,null,null,null,null,null,null,null,null,null,null,null,null,null,null,null,null,null,null,null,null,null,null,null,null,null,null,null,null,null,null,null,null,null,null,null,null,null,null,null,null,null,null,null,null,null,null,null,null,{"$f":"IF(SUMPRODUCT((OFFSET($A21,0,31*($A$9-1)+1,1,31)<>\"\")*(IF(OFFSET($A21,0,31*($A$9-1)+1,1,31)=$NL$9,0.5,1)*(OFFSET($A$9,0,31*($A$9-1)+1,1,31))))=0,\"\",SUMPRODUCT((OFFSET($A21,0,31*($A$9-1)+1,1,31)<>\"\")*(IF(OFFSET($A21,0,31*($A$9-1)+1,1,31)=$NL$9,0.5,1)*(OFFSET($A$9,0,31*($A$9-1)+1,1,31)))))","v":""},{"$f":"IF(SUMPRODUCT((OFFSET($A21,0,1,1,372)<>\"\")*(IF(OFFSET($A21,0,1,1,372)=$NL$9,0.5,1)*(OFFSET($A$9,0,1,1,372))))=0,\"\",SUMPRODUCT((OFFSET($A21,0,1,1,372)<>\"\")*(IF(OFFSET($A21,0,1,1,372)=$NL$9,0.5,1)*(OFFSET($A$9,0,1,1,372)))))","v":""},"",null,{"$f":"IF(SUMPRODUCT((OFFSET($A21,0,1,1,372)<>\"\")*(OFFSET($A$9,0,1,1,372))*((OFFSET($A21,0,1,1,372))=NL$5))=0,\"\",SUMPRODUCT((OFFSET($A21,0,1,1,372)<>\"\")*(OFFSET($A$9,0,1,1,372))*((OFFSET($A21,0,1,1,372))=NL$5)))","v":""},{"$f":"IF(SUMPRODUCT((OFFSET($A21,0,1,1,372)<>\"\")*(OFFSET($A$9,0,1,1,372))*((OFFSET($A21,0,1,1,372))=NL$6))=0,\"\",SUMPRODUCT((OFFSET($A21,0,1,1,372)<>\"\")*(OFFSET($A$9,0,1,1,372))*((OFFSET($A21,0,1,1,372))=NL$6)))","v":""},{"$f":"IF(SUMPRODUCT((OFFSET($A21,0,1,1,372)<>\"\")*(OFFSET($A$9,0,1,1,372))*((OFFSET($A21,0,1,1,372))=NL$7))=0,\"\",SUMPRODUCT((OFFSET($A21,0,1,1,372)<>\"\")*(OFFSET($A$9,0,1,1,372))*((OFFSET($A21,0,1,1,372))=NL$7)))","v":""},{"$f":"IF(SUMPRODUCT((OFFSET($A21,0,1,1,372)<>\"\")*(OFFSET($A$9,0,1,1,372))*((OFFSET($A21,0,1,1,372))=NL$8))=0,\"\",SUMPRODUCT((OFFSET($A21,0,1,1,372)<>\"\")*(OFFSET($A$9,0,1,1,372))*((OFFSET($A21,0,1,1,372))=NL$8)))","v":""},{"$f":"IF(SUMPRODUCT((OFFSET($A21,0,1,1,372)<>\"\")*(OFFSET($A$9,0,1,1,372))*((OFFSET($A21,0,1,1,372))=NL$9))=0,\"\",SUMPRODUCT((OFFSET($A21,0,1,1,372)<>\"\")*(OFFSET($A$9,0,1,1,372))*((OFFSET($A21,0,1,1,372))=NL$9)))","v":""}]
[null,null,null,null,null,null,null,null,null,null,null,null,null,null,null,null,null,null,null,null,null,null,null,null,null,null,null,null,null,null,null,null,null,null,null,null,null,null,null,null,null,null,null,null,null,null,null,null,null,null,null,null,null,null,null,null,null,null,null,null,null,null,null,null,null,null,null,null,null,null,null,null,null,null,null,null,null,null,null,null,null,null,null,null,null,null,null,null,null,null,null,null,null,null,null,null,null,null,null,null,null,null,null,null,null,null,null,null,null,null,null,null,null,null,null,null,null,null,null,null,null,null,null,null,null,null,null,null,null,null,null,null,null,null,null,null,null,null,null,null,null,null,null,null,null,null,null,null,null,null,null,null,null,null,null,null,null,null,null,null,null,null,null,null,null,null,null,null,null,null,null,null,null,null,null,null,null,null,null,null,null,null,null,null,null,null,null,null,null,null,null,null,null,null,null,null,null,null,null,null,null,null,null,null,null,null,null,null,null,null,null,null,null,null,null,null,null,null,null,null,null,null,null,null,null,null,null,null,null,null,null,null,null,null,null,null,null,null,null,null,null,null,null,null,null,null,null,null,null,null,null,null,null,null,null,null,null,null,null,null,null,null,null,null,null,null,null,null,null,null,null,null,null,null,null,null,null,null,null,null,null,null,null,null,null,null,null,null,null,null,null,null,null,null,null,null,null,null,null,null,null,null,null,null,null,null,null,null,null,null,null,null,null,null,null,null,null,null,null,null,null,null,null,null,null,null,null,null,null,null,null,null,null,null,null,null,null,null,null,null,null,null,null,null,null,null,null,null,null,null,null,null,null,null,null,null,null,null,null,null,null,null,null,null,null,null,null,null,null,null,null,null,null,null,null,null,null,{"$f":"IF(SUMPRODUCT((OFFSET($A22,0,31*($A$9-1)+1,1,31)<>\"\")*(IF(OFFSET($A22,0,31*($A$9-1)+1,1,31)=$NL$9,0.5,1)*(OFFSET($A$9,0,31*($A$9-1)+1,1,31))))=0,\"\",SUMPRODUCT((OFFSET($A22,0,31*($A$9-1)+1,1,31)<>\"\")*(IF(OFFSET($A22,0,31*($A$9-1)+1,1,31)=$NL$9,0.5,1)*(OFFSET($A$9,0,31*($A$9-1)+1,1,31)))))","v":""},{"$f":"IF(SUMPRODUCT((OFFSET($A22,0,1,1,372)<>\"\")*(IF(OFFSET($A22,0,1,1,372)=$NL$9,0.5,1)*(OFFSET($A$9,0,1,1,372))))=0,\"\",SUMPRODUCT((OFFSET($A22,0,1,1,372)<>\"\")*(IF(OFFSET($A22,0,1,1,372)=$NL$9,0.5,1)*(OFFSET($A$9,0,1,1,372)))))","v":""},"",null,{"$f":"IF(SUMPRODUCT((OFFSET($A22,0,1,1,372)<>\"\")*(OFFSET($A$9,0,1,1,372))*((OFFSET($A22,0,1,1,372))=NL$5))=0,\"\",SUMPRODUCT((OFFSET($A22,0,1,1,372)<>\"\")*(OFFSET($A$9,0,1,1,372))*((OFFSET($A22,0,1,1,372))=NL$5)))","v":""},{"$f":"IF(SUMPRODUCT((OFFSET($A22,0,1,1,372)<>\"\")*(OFFSET($A$9,0,1,1,372))*((OFFSET($A22,0,1,1,372))=NL$6))=0,\"\",SUMPRODUCT((OFFSET($A22,0,1,1,372)<>\"\")*(OFFSET($A$9,0,1,1,372))*((OFFSET($A22,0,1,1,372))=NL$6)))","v":""},{"$f":"IF(SUMPRODUCT((OFFSET($A22,0,1,1,372)<>\"\")*(OFFSET($A$9,0,1,1,372))*((OFFSET($A22,0,1,1,372))=NL$7))=0,\"\",SUMPRODUCT((OFFSET($A22,0,1,1,372)<>\"\")*(OFFSET($A$9,0,1,1,372))*((OFFSET($A22,0,1,1,372))=NL$7)))","v":""},{"$f":"IF(SUMPRODUCT((OFFSET($A22,0,1,1,372)<>\"\")*(OFFSET($A$9,0,1,1,372))*((OFFSET($A22,0,1,1,372))=NL$8))=0,\"\",SUMPRODUCT((OFFSET($A22,0,1,1,372)<>\"\")*(OFFSET($A$9,0,1,1,372))*((OFFSET($A22,0,1,1,372))=NL$8)))","v":""},{"$f":"IF(SUMPRODUCT((OFFSET($A22,0,1,1,372)<>\"\")*(OFFSET($A$9,0,1,1,372))*((OFFSET($A22,0,1,1,372))=NL$9))=0,\"\",SUMPRODUCT((OFFSET($A22,0,1,1,372)<>\"\")*(OFFSET($A$9,0,1,1,372))*((OFFSET($A22,0,1,1,372))=NL$9)))","v":""}]
[null,null,null,null,null,null,null,null,null,null,null,null,null,null,null,null,null,null,null,null,null,null,null,null,null,null,null,null,null,null,null,null,null,null,null,null,null,null,null,null,null,null,null,null,null,null,null,null,null,null,null,null,null,null,null,null,null,null,null,null,null,null,null,null,null,null,null,null,null,null,null,null,null,null,null,null,null,null,null,null,null,null,null,null,null,null,null,null,null,null,null,null,null,null,null,null,null,null,null,null,null,null,null,null,null,null,null,null,null,null,null,null,null,null,null,null,null,null,null,null,null,null,null,null,null,null,null,null,null,null,null,null,null,null,null,null,null,null,null,null,null,null,null,null,null,null,null,null,null,null,null,null,null,null,null,null,null,null,null,null,null,null,null,null,null,null,null,null,null,null,null,null,null,null,null,null,null,null,null,null,null,null,null,null,null,null,null,null,null,null,null,null,null,null,null,null,null,null,null,null,null,null,null,null,null,null,null,null,null,null,null,null,null,null,null,null,null,null,null,null,null,null,null,null,null,null,null,null,null,null,null,null,null,null,null,null,null,null,null,null,null,null,null,null,null,null,null,null,null,null,null,null,null,null,null,null,null,null,null,null,null,null,null,null,null,null,null,null,null,null,null,null,null,null,null,null,null,null,null,null,null,null,null,null,null,null,null,null,null,null,null,null,null,null,null,null,null,null,null,null,null,null,null,null,null,null,null,null,null,null,null,null,null,null,null,null,null,null,null,null,null,null,null,null,null,null,null,null,null,null,null,null,null,null,null,null,null,null,null,null,null,null,null,null,null,null,null,null,null,null,null,null,null,null,null,null,null,null,null,null,null,null,null,null,null,null,null,null,null,null,null,null,null,null,null,null,null,{"$f":"IF(SUMPRODUCT((OFFSET($A23,0,31*($A$9-1)+1,1,31)<>\"\")*(IF(OFFSET($A23,0,31*($A$9-1)+1,1,31)=$NL$9,0.5,1)*(OFFSET($A$9,0,31*($A$9-1)+1,1,31))))=0,\"\",SUMPRODUCT((OFFSET($A23,0,31*($A$9-1)+1,1,31)<>\"\")*(IF(OFFSET($A23,0,31*($A$9-1)+1,1,31)=$NL$9,0.5,1)*(OFFSET($A$9,0,31*($A$9-1)+1,1,31)))))","v":""},{"$f":"IF(SUMPRODUCT((OFFSET($A23,0,1,1,372)<>\"\")*(IF(OFFSET($A23,0,1,1,372)=$NL$9,0.5,1)*(OFFSET($A$9,0,1,1,372))))=0,\"\",SUMPRODUCT((OFFSET($A23,0,1,1,372)<>\"\")*(IF(OFFSET($A23,0,1,1,372)=$NL$9,0.5,1)*(OFFSET($A$9,0,1,1,372)))))","v":""},"",null,{"$f":"IF(SUMPRODUCT((OFFSET($A23,0,1,1,372)<>\"\")*(OFFSET($A$9,0,1,1,372))*((OFFSET($A23,0,1,1,372))=NL$5))=0,\"\",SUMPRODUCT((OFFSET($A23,0,1,1,372)<>\"\")*(OFFSET($A$9,0,1,1,372))*((OFFSET($A23,0,1,1,372))=NL$5)))","v":""},{"$f":"IF(SUMPRODUCT((OFFSET($A23,0,1,1,372)<>\"\")*(OFFSET($A$9,0,1,1,372))*((OFFSET($A23,0,1,1,372))=NL$6))=0,\"\",SUMPRODUCT((OFFSET($A23,0,1,1,372)<>\"\")*(OFFSET($A$9,0,1,1,372))*((OFFSET($A23,0,1,1,372))=NL$6)))","v":""},{"$f":"IF(SUMPRODUCT((OFFSET($A23,0,1,1,372)<>\"\")*(OFFSET($A$9,0,1,1,372))*((OFFSET($A23,0,1,1,372))=NL$7))=0,\"\",SUMPRODUCT((OFFSET($A23,0,1,1,372)<>\"\")*(OFFSET($A$9,0,1,1,372))*((OFFSET($A23,0,1,1,372))=NL$7)))","v":""},{"$f":"IF(SUMPRODUCT((OFFSET($A23,0,1,1,372)<>\"\")*(OFFSET($A$9,0,1,1,372))*((OFFSET($A23,0,1,1,372))=NL$8))=0,\"\",SUMPRODUCT((OFFSET($A23,0,1,1,372)<>\"\")*(OFFSET($A$9,0,1,1,372))*((OFFSET($A23,0,1,1,372))=NL$8)))","v":""},{"$f":"IF(SUMPRODUCT((OFFSET($A23,0,1,1,372)<>\"\")*(OFFSET($A$9,0,1,1,372))*((OFFSET($A23,0,1,1,372))=NL$9))=0,\"\",SUMPRODUCT((OFFSET($A23,0,1,1,372)<>\"\")*(OFFSET($A$9,0,1,1,372))*((OFFSET($A23,0,1,1,372))=NL$9)))","v":""}]
[null,null,null,null,null,null,null,null,null,null,null,null,null,null,null,null,null,null,null,null,null,null,null,null,null,null,null,null,null,null,null,null,null,null,null,null,null,null,null,null,null,null,null,null,null,null,null,null,null,null,null,null,null,null,null,null,null,null,null,null,null,null,null,null,null,null,null,null,null,null,null,null,null,null,null,null,null,null,null,null,null,null,null,null,null,null,null,null,null,null,null,null,null,null,null,null,null,null,null,null,null,null,null,null,null,null,null,null,null,null,null,null,null,null,null,null,null,null,null,null,null,null,null,null,null,null,null,null,null,null,null,null,null,null,null,null,null,null,null,null,null,null,null,null,null,null,null,null,null,null,null,null,null,null,null,null,null,null,null,null,null,null,null,null,null,null,null,null,null,null,null,null,null,null,null,null,null,null,null,null,null,null,null,null,null,null,null,null,null,null,null,null,null,null,null,null,null,null,null,null,null,null,null,null,null,null,null,null,null,null,null,null,null,null,null,null,null,null,null,null,null,null,null,null,null,null,null,null,null,null,null,null,null,null,null,null,null,null,null,null,null,null,null,null,null,null,null,null,null,null,null,null,null,null,null,null,null,null,null,null,null,null,null,null,null,null,null,null,null,null,null,null,null,null,null,null,null,null,null,null,null,null,null,null,null,null,null,null,null,null,null,null,null,null,null,null,null,null,null,null,null,null,null,null,null,null,null,null,null,null,null,null,null,null,null,null,null,null,null,null,null,null,null,null,null,null,null,null,null,null,null,null,null,null,null,null,null,null,null,null,null,null,null,null,null,null,null,null,null,null,null,null,null,null,null,null,null,null,null,null,null,null,null,null,null,null,null,null,null,null,null,null,null,null,null,null,null,{"$f":"IF(SUMPRODUCT((OFFSET($A24,0,31*($A$9-1)+1,1,31)<>\"\")*(IF(OFFSET($A24,0,31*($A$9-1)+1,1,31)=$NL$9,0.5,1)*(OFFSET($A$9,0,31*($A$9-1)+1,1,31))))=0,\"\",SUMPRODUCT((OFFSET($A24,0,31*($A$9-1)+1,1,31)<>\"\")*(IF(OFFSET($A24,0,31*($A$9-1)+1,1,31)=$NL$9,0.5,1)*(OFFSET($A$9,0,31*($A$9-1)+1,1,31)))))","v":""},{"$f":"IF(SUMPRODUCT((OFFSET($A24,0,1,1,372)<>\"\")*(IF(OFFSET($A24,0,1,1,372)=$NL$9,0.5,1)*(OFFSET($A$9,0,1,1,372))))=0,\"\",SUMPRODUCT((OFFSET($A24,0,1,1,372)<>\"\")*(IF(OFFSET($A24,0,1,1,372)=$NL$9,0.5,1)*(OFFSET($A$9,0,1,1,372)))))","v":""},"",null,{"$f":"IF(SUMPRODUCT((OFFSET($A24,0,1,1,372)<>\"\")*(OFFSET($A$9,0,1,1,372))*((OFFSET($A24,0,1,1,372))=NL$5))=0,\"\",SUMPRODUCT((OFFSET($A24,0,1,1,372)<>\"\")*(OFFSET($A$9,0,1,1,372))*((OFFSET($A24,0,1,1,372))=NL$5)))","v":""},{"$f":"IF(SUMPRODUCT((OFFSET($A24,0,1,1,372)<>\"\")*(OFFSET($A$9,0,1,1,372))*((OFFSET($A24,0,1,1,372))=NL$6))=0,\"\",SUMPRODUCT((OFFSET($A24,0,1,1,372)<>\"\")*(OFFSET($A$9,0,1,1,372))*((OFFSET($A24,0,1,1,372))=NL$6)))","v":""},{"$f":"IF(SUMPRODUCT((OFFSET($A24,0,1,1,372)<>\"\")*(OFFSET($A$9,0,1,1,372))*((OFFSET($A24,0,1,1,372))=NL$7))=0,\"\",SUMPRODUCT((OFFSET($A24,0,1,1,372)<>\"\")*(OFFSET($A$9,0,1,1,372))*((OFFSET($A24,0,1,1,372))=NL$7)))","v":""},{"$f":"IF(SUMPRODUCT((OFFSET($A24,0,1,1,372)<>\"\")*(OFFSET($A$9,0,1,1,372))*((OFFSET($A24,0,1,1,372))=NL$8))=0,\"\",SUMPRODUCT((OFFSET($A24,0,1,1,372)<>\"\")*(OFFSET($A$9,0,1,1,372))*((OFFSET($A24,0,1,1,372))=NL$8)))","v":""},{"$f":"IF(SUMPRODUCT((OFFSET($A24,0,1,1,372)<>\"\")*(OFFSET($A$9,0,1,1,372))*((OFFSET($A24,0,1,1,372))=NL$9))=0,\"\",SUMPRODUCT((OFFSET($A24,0,1,1,372)<>\"\")*(OFFSET($A$9,0,1,1,372))*((OFFSET($A24,0,1,1,372))=NL$9)))","v":""}]
[null,null,null,null,null,null,null,null,null,null,null,null,null,null,null,null,null,null,null,null,null,null,null,null,null,null,null,null,null,null,null,null,null,null,null,null,null,null,null,null,null,null,null,null,null,null,null,null,null,null,null,null,null,null,null,null,null,null,null,null,null,null,null,null,null,null,null,null,null,null,null,null,null,null,null,null,null,null,null,null,null,null,null,null,null,null,null,null,null,null,null,null,null,null,null,null,null,null,null,null,null,null,null,null,null,null,null,null,null,null,null,null,null,null,null,null,null,null,null,null,null,null,null,null,null,null,null,null,null,null,null,null,null,null,null,null,null,null,null,null,null,null,null,null,null,null,null,null,null,null,null,null,null,null,null,null,null,null,null,null,null,null,null,null,null,null,null,null,null,null,null,null,null,null,null,null,null,null,null,null,null,null,null,null,null,null,null,null,null,null,null,null,null,null,null,null,null,null,null,null,null,null,null,null,null,null,null,null,null,null,null,null,null,null,null,null,null,null,null,null,null,null,null,null,null,null,null,null,null,null,null,null,null,null,null,null,null,null,null,null,null,null,null,null,null,null,null,null,null,null,null,null,null,null,null,null,null,null,null,null,null,null,null,null,null,null,null,null,null,null,null,null,null,null,null,null,null,null,null,null,null,null,null,null,null,null,null,null,null,null,null,null,null,null,null,null,null,null,null,null,null,null,null,null,null,null,null,null,null,null,null,null,null,null,null,null,null,null,null,null,null,null,null,null,null,null,null,null,null,null,null,null,null,null,null,null,null,null,null,null,null,null,null,null,null,null,null,null,null,null,null,null,null,null,null,null,null,null,null,null,null,null,null,null,null,null,null,null,null,null,null,null,null,null,null,null,null,{"$f":"IF(SUMPRODUCT((OFFSET($A25,0,31*($A$9-1)+1,1,31)<>\"\")*(IF(OFFSET($A25,0,31*($A$9-1)+1,1,31)=$NL$9,0.5,1)*(OFFSET($A$9,0,31*($A$9-1)+1,1,31))))=0,\"\",SUMPRODUCT((OFFSET($A25,0,31*($A$9-1)+1,1,31)<>\"\")*(IF(OFFSET($A25,0,31*($A$9-1)+1,1,31)=$NL$9,0.5,1)*(OFFSET($A$9,0,31*($A$9-1)+1,1,31)))))","v":""},{"$f":"IF(SUMPRODUCT((OFFSET($A25,0,1,1,372)<>\"\")*(IF(OFFSET($A25,0,1,1,372)=$NL$9,0.5,1)*(OFFSET($A$9,0,1,1,372))))=0,\"\",SUMPRODUCT((OFFSET($A25,0,1,1,372)<>\"\")*(IF(OFFSET($A25,0,1,1,372)=$NL$9,0.5,1)*(OFFSET($A$9,0,1,1,372)))))","v":""},"",null,{"$f":"IF(SUMPRODUCT((OFFSET($A25,0,1,1,372)<>\"\")*(OFFSET($A$9,0,1,1,372))*((OFFSET($A25,0,1,1,372))=NL$5))=0,\"\",SUMPRODUCT((OFFSET($A25,0,1,1,372)<>\"\")*(OFFSET($A$9,0,1,1,372))*((OFFSET($A25,0,1,1,372))=NL$5)))","v":""},{"$f":"IF(SUMPRODUCT((OFFSET($A25,0,1,1,372)<>\"\")*(OFFSET($A$9,0,1,1,372))*((OFFSET($A25,0,1,1,372))=NL$6))=0,\"\",SUMPRODUCT((OFFSET($A25,0,1,1,372)<>\"\")*(OFFSET($A$9,0,1,1,372))*((OFFSET($A25,0,1,1,372))=NL$6)))","v":""},{"$f":"IF(SUMPRODUCT((OFFSET($A25,0,1,1,372)<>\"\")*(OFFSET($A$9,0,1,1,372))*((OFFSET($A25,0,1,1,372))=NL$7))=0,\"\",SUMPRODUCT((OFFSET($A25,0,1,1,372)<>\"\")*(OFFSET($A$9,0,1,1,372))*((OFFSET($A25,0,1,1,372))=NL$7)))","v":""},{"$f":"IF(SUMPRODUCT((OFFSET($A25,0,1,1,372)<>\"\")*(OFFSET($A$9,0,1,1,372))*((OFFSET($A25,0,1,1,372))=NL$8))=0,\"\",SUMPRODUCT((OFFSET($A25,0,1,1,372)<>\"\")*(OFFSET($A$9,0,1,1,372))*((OFFSET($A25,0,1,1,372))=NL$8)))","v":""},{"$f":"IF(SUMPRODUCT((OFFSET($A25,0,1,1,372)<>\"\")*(OFFSET($A$9,0,1,1,372))*((OFFSET($A25,0,1,1,372))=NL$9))=0,\"\",SUMPRODUCT((OFFSET($A25,0,1,1,372)<>\"\")*(OFFSET($A$9,0,1,1,372))*((OFFSET($A25,0,1,1,372))=NL$9)))","v":""}]
[null,null,null,null,null,null,null,null,null,null,null,null,null,null,null,null,null,null,null,null,null,null,null,null,null,null,null,null,null,null,null,null,null,null,null,null,null,null,null,null,null,null,null,null,null,null,null,null,null,null,null,null,null,null,null,null,null,null,null,null,null,null,null,null,null,null,null,null,null,null,null,null,null,null,null,null,null,null,null,null,null,null,null,null,null,null,null,null,null,null,null,null,null,null,null,null,null,null,null,null,null,null,null,null,null,null,null,null,null,null,null,null,null,null,null,null,null,null,null,null,null,null,null,null,null,null,null,null,null,null,null,null,null,null,null,null,null,null,null,null,null,null,null,null,null,null,null,null,null,null,null,null,null,null,null,null,null,null,null,null,null,null,null,null,null,null,null,null,null,null,null,null,null,null,null,null,null,null,null,null,null,null,null,null,null,null,null,null,null,null,null,null,null,null,null,null,null,null,null,null,null,null,null,null,null,null,null,null,null,null,null,null,null,null,null,null,null,null,null,null,null,null,null,null,null,null,null,null,null,null,null,null,null,null,null,null,null,null,null,null,null,null,null,null,null,null,null,null,null,null,null,null,null,null,null,null,null,null,null,null,null,null,null,null,null,null,null,null,null,null,null,null,null,null,null,null,null,null,null,null,null,null,null,null,null,null,null,null,null,null,null,null,null,null,null,null,null,null,null,null,null,null,null,null,null,null,null,null,null,null,null,null,null,null,null,null,null,null,null,null,null,null,null,null,null,null,null,null,null,null,null,null,null,null,null,null,null,null,null,null,null,null,null,null,null,null,null,null,null,null,null,null,null,null,null,null,null,null,null,null,null,null,null,null,null,null,null,null,null,null,null,null,null,null,null,null,null,{"$f":"IF(SUMPRODUCT((OFFSET($A26,0,31*($A$9-1)+1,1,31)<>\"\")*(IF(OFFSET($A26,0,31*($A$9-1)+1,1,31)=$NL$9,0.5,1)*(OFFSET($A$9,0,31*($A$9-1)+1,1,31))))=0,\"\",SUMPRODUCT((OFFSET($A26,0,31*($A$9-1)+1,1,31)<>\"\")*(IF(OFFSET($A26,0,31*($A$9-1)+1,1,31)=$NL$9,0.5,1)*(OFFSET($A$9,0,31*($A$9-1)+1,1,31)))))","v":""},{"$f":"IF(SUMPRODUCT((OFFSET($A26,0,1,1,372)<>\"\")*(IF(OFFSET($A26,0,1,1,372)=$NL$9,0.5,1)*(OFFSET($A$9,0,1,1,372))))=0,\"\",SUMPRODUCT((OFFSET($A26,0,1,1,372)<>\"\")*(IF(OFFSET($A26,0,1,1,372)=$NL$9,0.5,1)*(OFFSET($A$9,0,1,1,372)))))","v":""},"",null,{"$f":"IF(SUMPRODUCT((OFFSET($A26,0,1,1,372)<>\"\")*(OFFSET($A$9,0,1,1,372))*((OFFSET($A26,0,1,1,372))=NL$5))=0,\"\",SUMPRODUCT((OFFSET($A26,0,1,1,372)<>\"\")*(OFFSET($A$9,0,1,1,372))*((OFFSET($A26,0,1,1,372))=NL$5)))","v":""},{"$f":"IF(SUMPRODUCT((OFFSET($A26,0,1,1,372)<>\"\")*(OFFSET($A$9,0,1,1,372))*((OFFSET($A26,0,1,1,372))=NL$6))=0,\"\",SUMPRODUCT((OFFSET($A26,0,1,1,372)<>\"\")*(OFFSET($A$9,0,1,1,372))*((OFFSET($A26,0,1,1,372))=NL$6)))","v":""},{"$f":"IF(SUMPRODUCT((OFFSET($A26,0,1,1,372)<>\"\")*(OFFSET($A$9,0,1,1,372))*((OFFSET($A26,0,1,1,372))=NL$7))=0,\"\",SUMPRODUCT((OFFSET($A26,0,1,1,372)<>\"\")*(OFFSET($A$9,0,1,1,372))*((OFFSET($A26,0,1,1,372))=NL$7)))","v":""},{"$f":"IF(SUMPRODUCT((OFFSET($A26,0,1,1,372)<>\"\")*(OFFSET($A$9,0,1,1,372))*((OFFSET($A26,0,1,1,372))=NL$8))=0,\"\",SUMPRODUCT((OFFSET($A26,0,1,1,372)<>\"\")*(OFFSET($A$9,0,1,1,372))*((OFFSET($A26,0,1,1,372))=NL$8)))","v":""},{"$f":"IF(SUMPRODUCT((OFFSET($A26,0,1,1,372)<>\"\")*(OFFSET($A$9,0,1,1,372))*((OFFSET($A26,0,1,1,372))=NL$9))=0,\"\",SUMPRODUCT((OFFSET($A26,0,1,1,372)<>\"\")*(OFFSET($A$9,0,1,1,372))*((OFFSET($A26,0,1,1,372))=NL$9)))","v":""}]
[null,null,null,null,null,null,null,null,null,null,null,null,null,null,null,null,null,null,null,null,null,null,null,null,null,null,null,null,null,null,null,null,null,null,null,null,null,null,null,null,null,null,null,null,null,null,null,null,null,null,null,null,null,null,null,null,null,null,null,null,null,null,null,null,null,null,null,null,null,null,null,null,null,null,null,null,null,null,null,null,null,null,null,null,null,null,null,null,null,null,null,null,null,null,null,null,null,null,null,null,null,null,null,null,null,null,null,null,null,null,null,null,null,null,null,null,null,null,null,null,null,null,null,null,null,null,null,null,null,null,null,null,null,null,null,null,null,null,null,null,null,null,null,null,null,null,null,null,null,null,null,null,null,null,null,null,null,null,null,null,null,null,null,null,null,null,null,null,null,null,null,null,null,null,null,null,null,null,null,null,null,null,null,null,null,null,null,null,null,null,null,null,null,null,null,null,null,null,null,null,null,null,null,null,null,null,null,null,null,null,null,null,null,null,null,null,null,null,null,null,null,null,null,null,null,null,null,null,null,null,null,null,null,null,null,null,null,null,null,null,null,null,null,null,null,null,null,null,null,null,null,null,null,null,null,null,null,null,null,null,null,null,null,null,null,null,null,null,null,null,null,null,null,null,null,null,null,null,null,null,null,null,null,null,null,null,null,null,null,null,null,null,null,null,null,null,null,null,null,null,null,null,null,null,null,null,null,null,null,null,null,null,null,null,null,null,null,null,null,null,null,null,null,null,null,null,null,null,null,null,null,null,null,null,null,null,null,null,null,null,null,null,null,null,null,null,null,null,null,null,null,null,null,null,null,null,null,null,null,null,null,null,null,null,null,null,null,null,null,null,null,null,null,null,null,null,null,{"$f":"IF(SUMPRODUCT((OFFSET($A27,0,31*($A$9-1)+1,1,31)<>\"\")*(IF(OFFSET($A27,0,31*($A$9-1)+1,1,31)=$NL$9,0.5,1)*(OFFSET($A$9,0,31*($A$9-1)+1,1,31))))=0,\"\",SUMPRODUCT((OFFSET($A27,0,31*($A$9-1)+1,1,31)<>\"\")*(IF(OFFSET($A27,0,31*($A$9-1)+1,1,31)=$NL$9,0.5,1)*(OFFSET($A$9,0,31*($A$9-1)+1,1,31)))))","v":""},{"$f":"IF(SUMPRODUCT((OFFSET($A27,0,1,1,372)<>\"\")*(IF(OFFSET($A27,0,1,1,372)=$NL$9,0.5,1)*(OFFSET($A$9,0,1,1,372))))=0,\"\",SUMPRODUCT((OFFSET($A27,0,1,1,372)<>\"\")*(IF(OFFSET($A27,0,1,1,372)=$NL$9,0.5,1)*(OFFSET($A$9,0,1,1,372)))))","v":""},"",null,{"$f":"IF(SUMPRODUCT((OFFSET($A27,0,1,1,372)<>\"\")*(OFFSET($A$9,0,1,1,372))*((OFFSET($A27,0,1,1,372))=NL$5))=0,\"\",SUMPRODUCT((OFFSET($A27,0,1,1,372)<>\"\")*(OFFSET($A$9,0,1,1,372))*((OFFSET($A27,0,1,1,372))=NL$5)))","v":""},{"$f":"IF(SUMPRODUCT((OFFSET($A27,0,1,1,372)<>\"\")*(OFFSET($A$9,0,1,1,372))*((OFFSET($A27,0,1,1,372))=NL$6))=0,\"\",SUMPRODUCT((OFFSET($A27,0,1,1,372)<>\"\")*(OFFSET($A$9,0,1,1,372))*((OFFSET($A27,0,1,1,372))=NL$6)))","v":""},{"$f":"IF(SUMPRODUCT((OFFSET($A27,0,1,1,372)<>\"\")*(OFFSET($A$9,0,1,1,372))*((OFFSET($A27,0,1,1,372))=NL$7))=0,\"\",SUMPRODUCT((OFFSET($A27,0,1,1,372)<>\"\")*(OFFSET($A$9,0,1,1,372))*((OFFSET($A27,0,1,1,372))=NL$7)))","v":""},{"$f":"IF(SUMPRODUCT((OFFSET($A27,0,1,1,372)<>\"\")*(OFFSET($A$9,0,1,1,372))*((OFFSET($A27,0,1,1,372))=NL$8))=0,\"\",SUMPRODUCT((OFFSET($A27,0,1,1,372)<>\"\")*(OFFSET($A$9,0,1,1,372))*((OFFSET($A27,0,1,1,372))=NL$8)))","v":""},{"$f":"IF(SUMPRODUCT((OFFSET($A27,0,1,1,372)<>\"\")*(OFFSET($A$9,0,1,1,372))*((OFFSET($A27,0,1,1,372))=NL$9))=0,\"\",SUMPRODUCT((OFFSET($A27,0,1,1,372)<>\"\")*(OFFSET($A$9,0,1,1,372))*((OFFSET($A27,0,1,1,372))=NL$9)))","v":""}]
[null,null,null,null,null,null,null,null,null,null,null,null,null,null,null,null,null,null,null,null,null,null,null,null,null,null,null,null,null,null,null,null,null,null,null,null,null,null,null,null,null,null,null,null,null,null,null,null,null,null,null,null,null,null,null,null,null,null,null,null,null,null,null,null,null,null,null,null,null,null,null,null,null,null,null,null,null,null,null,null,null,null,null,null,null,null,null,null,null,null,null,null,null,null,null,null,null,null,null,null,null,null,null,null,null,null,null,null,null,null,null,null,null,null,null,null,null,null,null,null,null,null,null,null,null,null,null,null,null,null,null,null,null,null,null,null,null,null,null,null,null,null,null,null,null,null,null,null,null,null,null,null,null,null,null,null,null,null,null,null,null,null,null,null,null,null,null,null,null,null,null,null,null,null,null,null,null,null,null,null,null,null,null,null,null,null,null,null,null,null,null,null,null,null,null,null,null,null,null,null,null,null,null,null,null,null,null,null,null,null,null,null,null,null,null,null,null,null,null,null,null,null,null,null,null,null,null,null,null,null,null,null,null,null,null,null,null,null,null,null,null,null,null,null,null,null,null,null,null,null,null,null,null,null,null,null,null,null,null,null,null,null,null,null,null,null,null,null,null,null,null,null,null,null,null,null,null,null,null,null,null,null,null,null,null,null,null,null,null,null,null,null,null,null,null,null,null,null,null,null,null,null,null,null,null,null,null,null,null,null,null,null,null,null,null,null,null,null,null,null,null,null,null,null,null,null,null,null,null,null,null,null,null,null,null,null,null,null,null,null,null,null,null,null,null,null,null,null,null,null,null,null,null,null,null,null,null,null,null,null,null,null,null,null,null,null,null,null,null,null,null,null,null,null,null,null,null,{"$f":"IF(SUMPRODUCT((OFFSET($A28,0,31*($A$9-1)+1,1,31)<>\"\")*(IF(OFFSET($A28,0,31*($A$9-1)+1,1,31)=$NL$9,0.5,1)*(OFFSET($A$9,0,31*($A$9-1)+1,1,31))))=0,\"\",SUMPRODUCT((OFFSET($A28,0,31*($A$9-1)+1,1,31)<>\"\")*(IF(OFFSET($A28,0,31*($A$9-1)+1,1,31)=$NL$9,0.5,1)*(OFFSET($A$9,0,31*($A$9-1)+1,1,31)))))","v":""},{"$f":"IF(SUMPRODUCT((OFFSET($A28,0,1,1,372)<>\"\")*(IF(OFFSET($A28,0,1,1,372)=$NL$9,0.5,1)*(OFFSET($A$9,0,1,1,372))))=0,\"\",SUMPRODUCT((OFFSET($A28,0,1,1,372)<>\"\")*(IF(OFFSET($A28,0,1,1,372)=$NL$9,0.5,1)*(OFFSET($A$9,0,1,1,372)))))","v":""},"",null,{"$f":"IF(SUMPRODUCT((OFFSET($A28,0,1,1,372)<>\"\")*(OFFSET($A$9,0,1,1,372))*((OFFSET($A28,0,1,1,372))=NL$5))=0,\"\",SUMPRODUCT((OFFSET($A28,0,1,1,372)<>\"\")*(OFFSET($A$9,0,1,1,372))*((OFFSET($A28,0,1,1,372))=NL$5)))","v":""},{"$f":"IF(SUMPRODUCT((OFFSET($A28,0,1,1,372)<>\"\")*(OFFSET($A$9,0,1,1,372))*((OFFSET($A28,0,1,1,372))=NL$6))=0,\"\",SUMPRODUCT((OFFSET($A28,0,1,1,372)<>\"\")*(OFFSET($A$9,0,1,1,372))*((OFFSET($A28,0,1,1,372))=NL$6)))","v":""},{"$f":"IF(SUMPRODUCT((OFFSET($A28,0,1,1,372)<>\"\")*(OFFSET($A$9,0,1,1,372))*((OFFSET($A28,0,1,1,372))=NL$7))=0,\"\",SUMPRODUCT((OFFSET($A28,0,1,1,372)<>\"\")*(OFFSET($A$9,0,1,1,372))*((OFFSET($A28,0,1,1,372))=NL$7)))","v":""},{"$f":"IF(SUMPRODUCT((OFFSET($A28,0,1,1,372)<>\"\")*(OFFSET($A$9,0,1,1,372))*((OFFSET($A28,0,1,1,372))=NL$8))=0,\"\",SUMPRODUCT((OFFSET($A28,0,1,1,372)<>\"\")*(OFFSET($A$9,0,1,1,372))*((OFFSET($A28,0,1,1,372))=NL$8)))","v":""},{"$f":"IF(SUMPRODUCT((OFFSET($A28,0,1,1,372)<>\"\")*(OFFSET($A$9,0,1,1,372))*((OFFSET($A28,0,1,1,372))=NL$9))=0,\"\",SUMPRODUCT((OFFSET($A28,0,1,1,372)<>\"\")*(OFFSET($A$9,0,1,1,372))*((OFFSET($A28,0,1,1,372))=NL$9)))","v":""}]
[null,null,null,null,null,null,null,null,null,null,null,null,null,null,null,null,null,null,null,null,null,null,null,null,null,null,null,null,null,null,null,null,null,null,null,null,null,null,null,null,null,null,null,null,null,null,null,null,null,null,null,null,null,null,null,null,null,null,null,null,null,null,null,null,null,null,null,null,null,null,null,null,null,null,null,null,null,null,null,null,null,null,null,null,null,null,null,null,null,null,null,null,null,null,null,null,null,null,null,null,null,null,null,null,null,null,null,null,null,null,null,null,null,null,null,null,null,null,null,null,null,null,null,null,null,null,null,null,null,null,null,null,null,null,null,null,null,null,null,null,null,null,null,null,null,null,null,null,null,null,null,null,null,null,null,null,null,null,null,null,null,null,null,null,null,null,null,null,null,null,null,null,null,null,null,null,null,null,null,null,null,null,null,null,null,null,null,null,null,null,null,null,null,null,null,null,null,null,null,null,null,null,null,null,null,null,null,null,null,null,null,null,null,null,null,null,null,null,null,null,null,null,null,null,null,null,null,null,null,null,null,null,null,null,null,null,null,null,null,null,null,null,null,null,null,null,null,null,null,null,null,null,null,null,null,null,null,null,null,null,null,null,null,null,null,null,null,null,null,null,null,null,null,null,null,null,null,null,null,null,null,null,null,null,null,null,null,null,null,null,null,null,null,null,null,null,null,null,null,null,null,null,null,null,null,null,null,null,null,null,null,null,null,null,null,null,null,null,null,null,null,null,null,null,null,null,null,null,null,null,null,null,null,null,null,null,null,null,null,null,null,null,null,null,null,null,null,null,null,null,null,null,null,null,null,null,null,null,null,null,null,null,null,null,null,null,null,null,null,null,null,null,null,null,null,null,null,{"$f":"IF(SUMPRODUCT((OFFSET($A29,0,31*($A$9-1)+1,1,31)<>\"\")*(IF(OFFSET($A29,0,31*($A$9-1)+1,1,31)=$NL$9,0.5,1)*(OFFSET($A$9,0,31*($A$9-1)+1,1,31))))=0,\"\",SUMPRODUCT((OFFSET($A29,0,31*($A$9-1)+1,1,31)<>\"\")*(IF(OFFSET($A29,0,31*($A$9-1)+1,1,31)=$NL$9,0.5,1)*(OFFSET($A$9,0,31*($A$9-1)+1,1,31)))))","v":""},{"$f":"IF(SUMPRODUCT((OFFSET($A29,0,1,1,372)<>\"\")*(IF(OFFSET($A29,0,1,1,372)=$NL$9,0.5,1)*(OFFSET($A$9,0,1,1,372))))=0,\"\",SUMPRODUCT((OFFSET($A29,0,1,1,372)<>\"\")*(IF(OFFSET($A29,0,1,1,372)=$NL$9,0.5,1)*(OFFSET($A$9,0,1,1,372)))))","v":""},"",null,{"$f":"IF(SUMPRODUCT((OFFSET($A29,0,1,1,372)<>\"\")*(OFFSET($A$9,0,1,1,372))*((OFFSET($A29,0,1,1,372))=NL$5))=0,\"\",SUMPRODUCT((OFFSET($A29,0,1,1,372)<>\"\")*(OFFSET($A$9,0,1,1,372))*((OFFSET($A29,0,1,1,372))=NL$5)))","v":""},{"$f":"IF(SUMPRODUCT((OFFSET($A29,0,1,1,372)<>\"\")*(OFFSET($A$9,0,1,1,372))*((OFFSET($A29,0,1,1,372))=NL$6))=0,\"\",SUMPRODUCT((OFFSET($A29,0,1,1,372)<>\"\")*(OFFSET($A$9,0,1,1,372))*((OFFSET($A29,0,1,1,372))=NL$6)))","v":""},{"$f":"IF(SUMPRODUCT((OFFSET($A29,0,1,1,372)<>\"\")*(OFFSET($A$9,0,1,1,372))*((OFFSET($A29,0,1,1,372))=NL$7))=0,\"\",SUMPRODUCT((OFFSET($A29,0,1,1,372)<>\"\")*(OFFSET($A$9,0,1,1,372))*((OFFSET($A29,0,1,1,372))=NL$7)))","v":""},{"$f":"IF(SUMPRODUCT((OFFSET($A29,0,1,1,372)<>\"\")*(OFFSET($A$9,0,1,1,372))*((OFFSET($A29,0,1,1,372))=NL$8))=0,\"\",SUMPRODUCT((OFFSET($A29,0,1,1,372)<>\"\")*(OFFSET($A$9,0,1,1,372))*((OFFSET($A29,0,1,1,372))=NL$8)))","v":""},{"$f":"IF(SUMPRODUCT((OFFSET($A29,0,1,1,372)<>\"\")*(OFFSET($A$9,0,1,1,372))*((OFFSET($A29,0,1,1,372))=NL$9))=0,\"\",SUMPRODUCT((OFFSET($A29,0,1,1,372)<>\"\")*(OFFSET($A$9,0,1,1,372))*((OFFSET($A29,0,1,1,372))=NL$9)))","v":""}]
[null,null,null,null,null,null,null,null,null,null,null,null,null,null,null,null,null,null,null,null,null,null,null,null,null,null,null,null,null,null,null,null,null,null,null,null,null,null,null,null,null,null,null,null,null,null,null,null,null,null,null,null,null,null,null,null,null,null,null,null,null,null,null,null,null,null,null,null,null,null,null,null,null,null,null,null,null,null,null,null,null,null,null,null,null,null,null,null,null,null,null,null,null,null,null,null,null,null,null,null,null,null,null,null,null,null,null,null,null,null,null,null,null,null,null,null,null,null,null,null,null,null,null,null,null,null,null,null,null,null,null,null,null,null,null,null,null,null,null,null,null,null,null,null,null,null,null,null,null,null,null,null,null,null,null,null,null,null,null,null,null,null,null,null,null,null,null,null,null,null,null,null,null,null,null,null,null,null,null,null,null,null,null,null,null,null,null,null,null,null,null,null,null,null,null,null,null,null,null,null,null,null,null,null,null,null,null,null,null,null,null,null,null,null,null,null,null,null,null,null,null,null,null,null,null,null,null,null,null,null,null,null,null,null,null,null,null,null,null,null,null,null,null,null,null,null,null,null,null,null,null,null,null,null,null,null,null,null,null,null,null,null,null,null,null,null,null,null,null,null,null,null,null,null,null,null,null,null,null,null,null,null,null,null,null,null,null,null,null,null,null,null,null,null,null,null,null,null,null,null,null,null,null,null,null,null,null,null,null,null,null,null,null,null,null,null,null,null,null,null,null,null,null,null,null,null,null,null,null,null,null,null,null,null,null,null,null,null,null,null,null,null,null,null,null,null,null,null,null,null,null,null,null,null,null,null,null,null,null,null,null,null,null,null,null,null,null,null,null,null,null,null,null,null,null,null,null,{"$f":"IF(SUMPRODUCT((OFFSET($A30,0,31*($A$9-1)+1,1,31)<>\"\")*(IF(OFFSET($A30,0,31*($A$9-1)+1,1,31)=$NL$9,0.5,1)*(OFFSET($A$9,0,31*($A$9-1)+1,1,31))))=0,\"\",SUMPRODUCT((OFFSET($A30,0,31*($A$9-1)+1,1,31)<>\"\")*(IF(OFFSET($A30,0,31*($A$9-1)+1,1,31)=$NL$9,0.5,1)*(OFFSET($A$9,0,31*($A$9-1)+1,1,31)))))","v":""},{"$f":"IF(SUMPRODUCT((OFFSET($A30,0,1,1,372)<>\"\")*(IF(OFFSET($A30,0,1,1,372)=$NL$9,0.5,1)*(OFFSET($A$9,0,1,1,372))))=0,\"\",SUMPRODUCT((OFFSET($A30,0,1,1,372)<>\"\")*(IF(OFFSET($A30,0,1,1,372)=$NL$9,0.5,1)*(OFFSET($A$9,0,1,1,372)))))","v":""},"",null,{"$f":"IF(SUMPRODUCT((OFFSET($A30,0,1,1,372)<>\"\")*(OFFSET($A$9,0,1,1,372))*((OFFSET($A30,0,1,1,372))=NL$5))=0,\"\",SUMPRODUCT((OFFSET($A30,0,1,1,372)<>\"\")*(OFFSET($A$9,0,1,1,372))*((OFFSET($A30,0,1,1,372))=NL$5)))","v":""},{"$f":"IF(SUMPRODUCT((OFFSET($A30,0,1,1,372)<>\"\")*(OFFSET($A$9,0,1,1,372))*((OFFSET($A30,0,1,1,372))=NL$6))=0,\"\",SUMPRODUCT((OFFSET($A30,0,1,1,372)<>\"\")*(OFFSET($A$9,0,1,1,372))*((OFFSET($A30,0,1,1,372))=NL$6)))","v":""},{"$f":"IF(SUMPRODUCT((OFFSET($A30,0,1,1,372)<>\"\")*(OFFSET($A$9,0,1,1,372))*((OFFSET($A30,0,1,1,372))=NL$7))=0,\"\",SUMPRODUCT((OFFSET($A30,0,1,1,372)<>\"\")*(OFFSET($A$9,0,1,1,372))*((OFFSET($A30,0,1,1,372))=NL$7)))","v":""},{"$f":"IF(SUMPRODUCT((OFFSET($A30,0,1,1,372)<>\"\")*(OFFSET($A$9,0,1,1,372))*((OFFSET($A30,0,1,1,372))=NL$8))=0,\"\",SUMPRODUCT((OFFSET($A30,0,1,1,372)<>\"\")*(OFFSET($A$9,0,1,1,372))*((OFFSET($A30,0,1,1,372))=NL$8)))","v":""},{"$f":"IF(SUMPRODUCT((OFFSET($A30,0,1,1,372)<>\"\")*(OFFSET($A$9,0,1,1,372))*((OFFSET($A30,0,1,1,372))=NL$9))=0,\"\",SUMPRODUCT((OFFSET($A30,0,1,1,372)<>\"\")*(OFFSET($A$9,0,1,1,372))*((OFFSET($A30,0,1,1,372))=NL$9)))","v":""}]
[null,null,null,null,null,null,null,null,null,null,null,null,null,null,null,null,null,null,null,null,null,null,null,null,null,null,null,null,null,null,null,null,null,null,null,null,null,null,null,null,null,null,null,null,null,null,null,null,null,null,null,null,null,null,null,null,null,null,null,null,null,null,null,null,null,null,null,null,null,null,null,null,null,null,null,null,null,null,null,null,null,null,null,null,null,null,null,null,null,null,null,null,null,null,null,null,null,null,null,null,null,null,null,null,null,null,null,null,null,null,null,null,null,null,null,null,null,null,null,null,null,null,null,null,null,null,null,null,null,null,null,null,null,null,null,null,null,null,null,null,null,null,null,null,null,null,null,null,null,null,null,null,null,null,null,null,null,null,null,null,null,null,null,null,null,null,null,null,null,null,null,null,null,null,null,null,null,null,null,null,null,null,null,null,null,null,null,null,null,null,null,null,null,null,null,null,null,null,null,null,null,null,null,null,null,null,null,null,null,null,null,null,null,null,null,null,null,null,null,null,null,null,null,null,null,null,null,null,null,null,null,null,null,null,null,null,null,null,null,null,null,null,null,null,null,null,null,null,null,null,null,null,null,null,null,null,null,null,null,null,null,null,null,null,null,null,null,null,null,null,null,null,null,null,null,null,null,null,null,null,null,null,null,null,null,null,null,null,null,null,null,null,null,null,null,null,null,null,null,null,null,null,null,null,null,null,null,null,null,null,null,null,null,null,null,null,null,null,null,null,null,null,null,null,null,null,null,null,null,null,null,null,null,null,null,null,null,null,null,null,null,null,null,null,null,null,null,null,null,null,null,null,null,null,null,null,null,null,null,null,null,null,null,null,null,null,null,null,null,null,null,null,null,null,null,null,null,{"$f":"IF(SUMPRODUCT((OFFSET($A31,0,31*($A$9-1)+1,1,31)<>\"\")*(IF(OFFSET($A31,0,31*($A$9-1)+1,1,31)=$NL$9,0.5,1)*(OFFSET($A$9,0,31*($A$9-1)+1,1,31))))=0,\"\",SUMPRODUCT((OFFSET($A31,0,31*($A$9-1)+1,1,31)<>\"\")*(IF(OFFSET($A31,0,31*($A$9-1)+1,1,31)=$NL$9,0.5,1)*(OFFSET($A$9,0,31*($A$9-1)+1,1,31)))))","v":""},{"$f":"IF(SUMPRODUCT((OFFSET($A31,0,1,1,372)<>\"\")*(IF(OFFSET($A31,0,1,1,372)=$NL$9,0.5,1)*(OFFSET($A$9,0,1,1,372))))=0,\"\",SUMPRODUCT((OFFSET($A31,0,1,1,372)<>\"\")*(IF(OFFSET($A31,0,1,1,372)=$NL$9,0.5,1)*(OFFSET($A$9,0,1,1,372)))))","v":""},"",null,{"$f":"IF(SUMPRODUCT((OFFSET($A31,0,1,1,372)<>\"\")*(OFFSET($A$9,0,1,1,372))*((OFFSET($A31,0,1,1,372))=NL$5))=0,\"\",SUMPRODUCT((OFFSET($A31,0,1,1,372)<>\"\")*(OFFSET($A$9,0,1,1,372))*((OFFSET($A31,0,1,1,372))=NL$5)))","v":""},{"$f":"IF(SUMPRODUCT((OFFSET($A31,0,1,1,372)<>\"\")*(OFFSET($A$9,0,1,1,372))*((OFFSET($A31,0,1,1,372))=NL$6))=0,\"\",SUMPRODUCT((OFFSET($A31,0,1,1,372)<>\"\")*(OFFSET($A$9,0,1,1,372))*((OFFSET($A31,0,1,1,372))=NL$6)))","v":""},{"$f":"IF(SUMPRODUCT((OFFSET($A31,0,1,1,372)<>\"\")*(OFFSET($A$9,0,1,1,372))*((OFFSET($A31,0,1,1,372))=NL$7))=0,\"\",SUMPRODUCT((OFFSET($A31,0,1,1,372)<>\"\")*(OFFSET($A$9,0,1,1,372))*((OFFSET($A31,0,1,1,372))=NL$7)))","v":""},{"$f":"IF(SUMPRODUCT((OFFSET($A31,0,1,1,372)<>\"\")*(OFFSET($A$9,0,1,1,372))*((OFFSET($A31,0,1,1,372))=NL$8))=0,\"\",SUMPRODUCT((OFFSET($A31,0,1,1,372)<>\"\")*(OFFSET($A$9,0,1,1,372))*((OFFSET($A31,0,1,1,372))=NL$8)))","v":""},{"$f":"IF(SUMPRODUCT((OFFSET($A31,0,1,1,372)<>\"\")*(OFFSET($A$9,0,1,1,372))*((OFFSET($A31,0,1,1,372))=NL$9))=0,\"\",SUMPRODUCT((OFFSET($A31,0,1,1,372)<>\"\")*(OFFSET($A$9,0,1,1,372))*((OFFSET($A31,0,1,1,372))=NL$9)))","v":""}]
[null,null,null,null,null,null,null,null,null,null,null,null,null,null,null,null,null,null,null,null,null,null,null,null,null,null,null,null,null,null,null,null,null,null,null,null,null,null,null,null,null,null,null,null,null,null,null,null,null,null,null,null,null,null,null,null,null,null,null,null,null,null,null,null,null,null,null,null,null,null,null,null,null,null,null,null,null,null,null,null,null,null,null,null,null,null,null,null,null,null,null,null,null,null,null,null,null,null,null,null,null,null,null,null,null,null,null,null,null,null,null,null,null,null,null,null,null,null,null,null,null,null,null,null,null,null,null,null,null,null,null,null,null,null,null,null,null,null,null,null,null,null,null,null,null,null,null,null,null,null,null,null,null,null,null,null,null,null,null,null,null,null,null,null,null,null,null,null,null,null,null,null,null,null,null,null,null,null,null,null,null,null,null,null,null,null,null,null,null,null,null,null,null,null,null,null,null,null,null,null,null,null,null,null,null,null,null,null,null,null,null,null,null,null,null,null,null,null,null,null,null,null,null,null,null,null,null,null,null,null,null,null,null,null,null,null,null,null,null,null,null,null,null,null,null,null,null,null,null,null,null,null,null,null,null,null,null,null,null,null,null,null,null,null,null,null,null,null,null,null,null,null,null,null,null,null,null,null,null,null,null,null,null,null,null,null,null,null,null,null,null,null,null,null,null,null,null,null,null,null,null,null,null,null,null,null,null,null,null,null,null,null,null,null,null,null,null,null,null,null,null,null,null,null,null,null,null,null,null,null,null,null,null,null,null,null,null,null,null,null,null,null,null,null,null,null,null,null,null,null,null,null,null,null,null,null,null,null,null,null,null,null,null,null,null,null,null,null,null,null,null,null,null,null,null,null,null,{"$f":"IF(SUMPRODUCT((OFFSET($A32,0,31*($A$9-1)+1,1,31)<>\"\")*(IF(OFFSET($A32,0,31*($A$9-1)+1,1,31)=$NL$9,0.5,1)*(OFFSET($A$9,0,31*($A$9-1)+1,1,31))))=0,\"\",SUMPRODUCT((OFFSET($A32,0,31*($A$9-1)+1,1,31)<>\"\")*(IF(OFFSET($A32,0,31*($A$9-1)+1,1,31)=$NL$9,0.5,1)*(OFFSET($A$9,0,31*($A$9-1)+1,1,31)))))","v":""},{"$f":"IF(SUMPRODUCT((OFFSET($A32,0,1,1,372)<>\"\")*(IF(OFFSET($A32,0,1,1,372)=$NL$9,0.5,1)*(OFFSET($A$9,0,1,1,372))))=0,\"\",SUMPRODUCT((OFFSET($A32,0,1,1,372)<>\"\")*(IF(OFFSET($A32,0,1,1,372)=$NL$9,0.5,1)*(OFFSET($A$9,0,1,1,372)))))","v":""},"",null,{"$f":"IF(SUMPRODUCT((OFFSET($A32,0,1,1,372)<>\"\")*(OFFSET($A$9,0,1,1,372))*((OFFSET($A32,0,1,1,372))=NL$5))=0,\"\",SUMPRODUCT((OFFSET($A32,0,1,1,372)<>\"\")*(OFFSET($A$9,0,1,1,372))*((OFFSET($A32,0,1,1,372))=NL$5)))","v":""},{"$f":"IF(SUMPRODUCT((OFFSET($A32,0,1,1,372)<>\"\")*(OFFSET($A$9,0,1,1,372))*((OFFSET($A32,0,1,1,372))=NL$6))=0,\"\",SUMPRODUCT((OFFSET($A32,0,1,1,372)<>\"\")*(OFFSET($A$9,0,1,1,372))*((OFFSET($A32,0,1,1,372))=NL$6)))","v":""},{"$f":"IF(SUMPRODUCT((OFFSET($A32,0,1,1,372)<>\"\")*(OFFSET($A$9,0,1,1,372))*((OFFSET($A32,0,1,1,372))=NL$7))=0,\"\",SUMPRODUCT((OFFSET($A32,0,1,1,372)<>\"\")*(OFFSET($A$9,0,1,1,372))*((OFFSET($A32,0,1,1,372))=NL$7)))","v":""},{"$f":"IF(SUMPRODUCT((OFFSET($A32,0,1,1,372)<>\"\")*(OFFSET($A$9,0,1,1,372))*((OFFSET($A32,0,1,1,372))=NL$8))=0,\"\",SUMPRODUCT((OFFSET($A32,0,1,1,372)<>\"\")*(OFFSET($A$9,0,1,1,372))*((OFFSET($A32,0,1,1,372))=NL$8)))","v":""},{"$f":"IF(SUMPRODUCT((OFFSET($A32,0,1,1,372)<>\"\")*(OFFSET($A$9,0,1,1,372))*((OFFSET($A32,0,1,1,372))=NL$9))=0,\"\",SUMPRODUCT((OFFSET($A32,0,1,1,372)<>\"\")*(OFFSET($A$9,0,1,1,372))*((OFFSET($A32,0,1,1,372))=NL$9)))","v":""}]
[null,null,null,null,null,null,null,null,null,null,null,null,null,null,null,null,null,null,null,null,null,null,null,null,null,null,null,null,null,null,null,null,null,null,null,null,null,null,null,null,null,null,null,null,null,null,null,null,null,null,null,null,null,null,null,null,null,null,null,null,null,null,null,null,null,null,null,null,null,null,null,null,null,null,null,null,null,null,null,null,null,null,null,null,null,null,null,null,null,null,null,null,null,null,null,null,null,null,null,null,null,null,null,null,null,null,null,null,null,null,null,null,null,null,null,null,null,null,null,null,null,null,null,null,null,null,null,null,null,null,null,null,null,null,null,null,null,null,null,null,null,null,null,null,null,null,null,null,null,null,null,null,null,null,null,null,null,null,null,null,null,null,null,null,null,null,null,null,null,null,null,null,null,null,null,null,null,null,null,null,null,null,null,null,null,null,null,null,null,null,null,null,null,null,null,null,null,null,null,null,null,null,null,null,null,null,null,null,null,null,null,null,null,null,null,null,null,null,null,null,null,null,null,null,null,null,null,null,null,null,null,null,null,null,null,null,null,null,null,null,null,null,null,null,null,null,null,null,null,null,null,null,null,null,null,null,null,null,null,null,null,null,null,null,null,null,null,null,null,null,null,null,null,null,null,null,null,null,null,null,null,null,null,null,null,null,null,null,null,null,null,null,null,null,null,null,null,null,null,null,null,null,null,null,null,null,null,null,null,null,null,null,null,null,null,null,null,null,null,null,null,null,null,null,null,null,null,null,null,null,null,null,null,null,null,null,null,null,null,null,null,null,null,null,null,null,null,null,null,null,null,null,null,null,null,null,null,null,null,null,null,null,null,null,null,null,null,null,null,null,null,null,null,null,null,null,null,{"$f":"IF(SUMPRODUCT((OFFSET($A33,0,31*($A$9-1)+1,1,31)<>\"\")*(IF(OFFSET($A33,0,31*($A$9-1)+1,1,31)=$NL$9,0.5,1)*(OFFSET($A$9,0,31*($A$9-1)+1,1,31))))=0,\"\",SUMPRODUCT((OFFSET($A33,0,31*($A$9-1)+1,1,31)<>\"\")*(IF(OFFSET($A33,0,31*($A$9-1)+1,1,31)=$NL$9,0.5,1)*(OFFSET($A$9,0,31*($A$9-1)+1,1,31)))))","v":""},{"$f":"IF(SUMPRODUCT((OFFSET($A33,0,1,1,372)<>\"\")*(IF(OFFSET($A33,0,1,1,372)=$NL$9,0.5,1)*(OFFSET($A$9,0,1,1,372))))=0,\"\",SUMPRODUCT((OFFSET($A33,0,1,1,372)<>\"\")*(IF(OFFSET($A33,0,1,1,372)=$NL$9,0.5,1)*(OFFSET($A$9,0,1,1,372)))))","v":""},"",null,{"$f":"IF(SUMPRODUCT((OFFSET($A33,0,1,1,372)<>\"\")*(OFFSET($A$9,0,1,1,372))*((OFFSET($A33,0,1,1,372))=NL$5))=0,\"\",SUMPRODUCT((OFFSET($A33,0,1,1,372)<>\"\")*(OFFSET($A$9,0,1,1,372))*((OFFSET($A33,0,1,1,372))=NL$5)))","v":""},{"$f":"IF(SUMPRODUCT((OFFSET($A33,0,1,1,372)<>\"\")*(OFFSET($A$9,0,1,1,372))*((OFFSET($A33,0,1,1,372))=NL$6))=0,\"\",SUMPRODUCT((OFFSET($A33,0,1,1,372)<>\"\")*(OFFSET($A$9,0,1,1,372))*((OFFSET($A33,0,1,1,372))=NL$6)))","v":""},{"$f":"IF(SUMPRODUCT((OFFSET($A33,0,1,1,372)<>\"\")*(OFFSET($A$9,0,1,1,372))*((OFFSET($A33,0,1,1,372))=NL$7))=0,\"\",SUMPRODUCT((OFFSET($A33,0,1,1,372)<>\"\")*(OFFSET($A$9,0,1,1,372))*((OFFSET($A33,0,1,1,372))=NL$7)))","v":""},{"$f":"IF(SUMPRODUCT((OFFSET($A33,0,1,1,372)<>\"\")*(OFFSET($A$9,0,1,1,372))*((OFFSET($A33,0,1,1,372))=NL$8))=0,\"\",SUMPRODUCT((OFFSET($A33,0,1,1,372)<>\"\")*(OFFSET($A$9,0,1,1,372))*((OFFSET($A33,0,1,1,372))=NL$8)))","v":""},{"$f":"IF(SUMPRODUCT((OFFSET($A33,0,1,1,372)<>\"\")*(OFFSET($A$9,0,1,1,372))*((OFFSET($A33,0,1,1,372))=NL$9))=0,\"\",SUMPRODUCT((OFFSET($A33,0,1,1,372)<>\"\")*(OFFSET($A$9,0,1,1,372))*((OFFSET($A33,0,1,1,372))=NL$9)))","v":""}]
[null,null,null,null,null,null,null,null,null,null,null,null,null,null,null,null,null,null,null,null,null,null,null,null,null,null,null,null,null,null,null,null,null,null,null,null,null,null,null,null,null,null,null,null,null,null,null,null,null,null,null,null,null,null,null,null,null,null,null,null,null,null,null,null,null,null,null,null,null,null,null,null,null,null,null,null,null,null,null,null,null,null,null,null,null,null,null,null,null,null,null,null,null,null,null,null,null,null,null,null,null,null,null,null,null,null,null,null,null,null,null,null,null,null,null,null,null,null,null,null,null,null,null,null,null,null,null,null,null,null,null,null,null,null,null,null,null,null,null,null,null,null,null,null,null,null,null,null,null,null,null,null,null,null,null,null,null,null,null,null,null,null,null,null,null,null,null,null,null,null,null,null,null,null,null,null,null,null,null,null,null,null,null,null,null,null,null,null,null,null,null,null,null,null,null,null,null,null,null,null,null,null,null,null,null,null,null,null,null,null,null,null,null,null,null,null,null,null,null,null,null,null,null,null,null,null,null,null,null,null,null,null,null,null,null,null,null,null,null,null,null,null,null,null,null,null,null,null,null,null,null,null,null,null,null,null,null,null,null,null,null,null,null,null,null,null,null,null,null,null,null,null,null,null,null,null,null,null,null,null,null,null,null,null,null,null,null,null,null,null,null,null,null,null,null,null,null,null,null,null,null,null,null,null,null,null,null,null,null,null,null,null,null,null,null,null,null,null,null,null,null,null,null,null,null,null,null,null,null,null,null,null,null,null,null,null,null,null,null,null,null,null,null,null,null,null,null,null,null,null,null,null,null,null,null,null,null,null,null,null,null,null,null,null,null,null,null,null,null,null,null,null,null,null,null,null,null,{"$f":"IF(SUMPRODUCT((OFFSET($A34,0,31*($A$9-1)+1,1,31)<>\"\")*(IF(OFFSET($A34,0,31*($A$9-1)+1,1,31)=$NL$9,0.5,1)*(OFFSET($A$9,0,31*($A$9-1)+1,1,31))))=0,\"\",SUMPRODUCT((OFFSET($A34,0,31*($A$9-1)+1,1,31)<>\"\")*(IF(OFFSET($A34,0,31*($A$9-1)+1,1,31)=$NL$9,0.5,1)*(OFFSET($A$9,0,31*($A$9-1)+1,1,31)))))","v":""},{"$f":"IF(SUMPRODUCT((OFFSET($A34,0,1,1,372)<>\"\")*(IF(OFFSET($A34,0,1,1,372)=$NL$9,0.5,1)*(OFFSET($A$9,0,1,1,372))))=0,\"\",SUMPRODUCT((OFFSET($A34,0,1,1,372)<>\"\")*(IF(OFFSET($A34,0,1,1,372)=$NL$9,0.5,1)*(OFFSET($A$9,0,1,1,372)))))","v":""},"",null,{"$f":"IF(SUMPRODUCT((OFFSET($A34,0,1,1,372)<>\"\")*(OFFSET($A$9,0,1,1,372))*((OFFSET($A34,0,1,1,372))=NL$5))=0,\"\",SUMPRODUCT((OFFSET($A34,0,1,1,372)<>\"\")*(OFFSET($A$9,0,1,1,372))*((OFFSET($A34,0,1,1,372))=NL$5)))","v":""},{"$f":"IF(SUMPRODUCT((OFFSET($A34,0,1,1,372)<>\"\")*(OFFSET($A$9,0,1,1,372))*((OFFSET($A34,0,1,1,372))=NL$6))=0,\"\",SUMPRODUCT((OFFSET($A34,0,1,1,372)<>\"\")*(OFFSET($A$9,0,1,1,372))*((OFFSET($A34,0,1,1,372))=NL$6)))","v":""},{"$f":"IF(SUMPRODUCT((OFFSET($A34,0,1,1,372)<>\"\")*(OFFSET($A$9,0,1,1,372))*((OFFSET($A34,0,1,1,372))=NL$7))=0,\"\",SUMPRODUCT((OFFSET($A34,0,1,1,372)<>\"\")*(OFFSET($A$9,0,1,1,372))*((OFFSET($A34,0,1,1,372))=NL$7)))","v":""},{"$f":"IF(SUMPRODUCT((OFFSET($A34,0,1,1,372)<>\"\")*(OFFSET($A$9,0,1,1,372))*((OFFSET($A34,0,1,1,372))=NL$8))=0,\"\",SUMPRODUCT((OFFSET($A34,0,1,1,372)<>\"\")*(OFFSET($A$9,0,1,1,372))*((OFFSET($A34,0,1,1,372))=NL$8)))","v":""},{"$f":"IF(SUMPRODUCT((OFFSET($A34,0,1,1,372)<>\"\")*(OFFSET($A$9,0,1,1,372))*((OFFSET($A34,0,1,1,372))=NL$9))=0,\"\",SUMPRODUCT((OFFSET($A34,0,1,1,372)<>\"\")*(OFFSET($A$9,0,1,1,372))*((OFFSET($A34,0,1,1,372))=NL$9)))","v":""}]
[null,null,null,null,null,null,null,null,null,null,null,null,null,null,null,null,null,null,null,null,null,null,null,null,null,null,null,null,null,null,null,null,null,null,null,null,null,null,null,null,null,null,null,null,null,null,null,null,null,null,null,null,null,null,null,null,null,null,null,null,null,null,null,null,null,null,null,null,null,null,null,null,null,null,null,null,null,null,null,null,null,null,null,null,null,null,null,null,null,null,null,null,null,null,null,null,null,null,null,null,null,null,null,null,null,null,null,null,null,null,null,null,null,null,null,null,null,null,null,null,null,null,null,null,null,null,null,null,null,null,null,null,null,null,null,null,null,null,null,null,null,null,null,null,null,null,null,null,null,null,null,null,null,null,null,null,null,null,null,null,null,null,null,null,null,null,null,null,null,null,null,null,null,null,null,null,null,null,null,null,null,null,null,null,null,null,null,null,null,null,null,null,null,null,null,null,null,null,null,null,null,null,null,null,null,null,null,null,null,null,null,null,null,null,null,null,null,null,null,null,null,null,null,null,null,null,null,null,null,null,null,null,null,null,null,null,null,null,null,null,null,null,null,null,null,null,null,null,null,null,null,null,null,null,null,null,null,null,null,null,null,null,null,null,null,null,null,null,null,null,null,null,null,null,null,null,null,null,null,null,null,null,null,null,null,null,null,null,null,null,null,null,null,null,null,null,null,null,null,null,null,null,null,null,null,null,null,null,null,null,null,null,null,null,null,null,null,null,null,null,null,null,null,null,null,null,null,null,null,null,null,null,null,null,null,null,null,null,null,null,null,null,null,null,null,null,null,null,null,null,null,null,null,null,null,null,null,null,null,null,null,null,null,null,null,null,null,null,null,null,null,null,null,null,null,null,null,{"$f":"IF(SUMPRODUCT((OFFSET($A35,0,31*($A$9-1)+1,1,31)<>\"\")*(IF(OFFSET($A35,0,31*($A$9-1)+1,1,31)=$NL$9,0.5,1)*(OFFSET($A$9,0,31*($A$9-1)+1,1,31))))=0,\"\",SUMPRODUCT((OFFSET($A35,0,31*($A$9-1)+1,1,31)<>\"\")*(IF(OFFSET($A35,0,31*($A$9-1)+1,1,31)=$NL$9,0.5,1)*(OFFSET($A$9,0,31*($A$9-1)+1,1,31)))))","v":""},{"$f":"IF(SUMPRODUCT((OFFSET($A35,0,1,1,372)<>\"\")*(IF(OFFSET($A35,0,1,1,372)=$NL$9,0.5,1)*(OFFSET($A$9,0,1,1,372))))=0,\"\",SUMPRODUCT((OFFSET($A35,0,1,1,372)<>\"\")*(IF(OFFSET($A35,0,1,1,372)=$NL$9,0.5,1)*(OFFSET($A$9,0,1,1,372)))))","v":""},"",null,{"$f":"IF(SUMPRODUCT((OFFSET($A35,0,1,1,372)<>\"\")*(OFFSET($A$9,0,1,1,372))*((OFFSET($A35,0,1,1,372))=NL$5))=0,\"\",SUMPRODUCT((OFFSET($A35,0,1,1,372)<>\"\")*(OFFSET($A$9,0,1,1,372))*((OFFSET($A35,0,1,1,372))=NL$5)))","v":""},{"$f":"IF(SUMPRODUCT((OFFSET($A35,0,1,1,372)<>\"\")*(OFFSET($A$9,0,1,1,372))*((OFFSET($A35,0,1,1,372))=NL$6))=0,\"\",SUMPRODUCT((OFFSET($A35,0,1,1,372)<>\"\")*(OFFSET($A$9,0,1,1,372))*((OFFSET($A35,0,1,1,372))=NL$6)))","v":""},{"$f":"IF(SUMPRODUCT((OFFSET($A35,0,1,1,372)<>\"\")*(OFFSET($A$9,0,1,1,372))*((OFFSET($A35,0,1,1,372))=NL$7))=0,\"\",SUMPRODUCT((OFFSET($A35,0,1,1,372)<>\"\")*(OFFSET($A$9,0,1,1,372))*((OFFSET($A35,0,1,1,372))=NL$7)))","v":""},{"$f":"IF(SUMPRODUCT((OFFSET($A35,0,1,1,372)<>\"\")*(OFFSET($A$9,0,1,1,372))*((OFFSET($A35,0,1,1,372))=NL$8))=0,\"\",SUMPRODUCT((OFFSET($A35,0,1,1,372)<>\"\")*(OFFSET($A$9,0,1,1,372))*((OFFSET($A35,0,1,1,372))=NL$8)))","v":""},{"$f":"IF(SUMPRODUCT((OFFSET($A35,0,1,1,372)<>\"\")*(OFFSET($A$9,0,1,1,372))*((OFFSET($A35,0,1,1,372))=NL$9))=0,\"\",SUMPRODUCT((OFFSET($A35,0,1,1,372)<>\"\")*(OFFSET($A$9,0,1,1,372))*((OFFSET($A35,0,1,1,372))=NL$9)))","v":""}]
[null,null,null,null,null,null,null,null,null,null,null,null,null,null,null,null,null,null,null,null,null,null,null,null,null,null,null,null,null,null,null,null,null,null,null,null,null,null,null,null,null,null,null,null,null,null,null,null,null,null,null,null,null,null,null,null,null,null,null,null,null,null,null,null,null,null,null,null,null,null,null,null,null,null,null,null,null,null,null,null,null,null,null,null,null,null,null,null,null,null,null,null,null,null,null,null,null,null,null,null,null,null,null,null,null,null,null,null,null,null,null,null,null,null,null,null,null,null,null,null,null,null,null,null,null,null,null,null,null,null,null,null,null,null,null,null,null,null,null,null,null,null,null,null,null,null,null,null,null,null,null,null,null,null,null,null,null,null,null,null,null,null,null,null,null,null,null,null,null,null,null,null,null,null,null,null,null,null,null,null,null,null,null,null,null,null,null,null,null,null,null,null,null,null,null,null,null,null,null,null,null,null,null,null,null,null,null,null,null,null,null,null,null,null,null,null,null,null,null,null,null,null,null,null,null,null,null,null,null,null,null,null,null,null,null,null,null,null,null,null,null,null,null,null,null,null,null,null,null,null,null,null,null,null,null,null,null,null,null,null,null,null,null,null,null,null,null,null,null,null,null,null,null,null,null,null,null,null,null,null,null,null,null,null,null,null,null,null,null,null,null,null,null,null,null,null,null,null,null,null,null,null,null,null,null,null,null,null,null,null,null,null,null,null,null,null,null,null,null,null,null,null,null,null,null,null,null,null,null,null,null,null,null,null,null,null,null,null,null,null,null,null,null,null,null,null,null,null,null,null,null,null,null,null,null,null,null,null,null,null,null,null,null,null,null,null,null,null,null,null,null,null,null,null,null,null,null,{"$f":"IF(SUMPRODUCT((OFFSET($A36,0,31*($A$9-1)+1,1,31)<>\"\")*(IF(OFFSET($A36,0,31*($A$9-1)+1,1,31)=$NL$9,0.5,1)*(OFFSET($A$9,0,31*($A$9-1)+1,1,31))))=0,\"\",SUMPRODUCT((OFFSET($A36,0,31*($A$9-1)+1,1,31)<>\"\")*(IF(OFFSET($A36,0,31*($A$9-1)+1,1,31)=$NL$9,0.5,1)*(OFFSET($A$9,0,31*($A$9-1)+1,1,31)))))","v":""},{"$f":"IF(SUMPRODUCT((OFFSET($A36,0,1,1,372)<>\"\")*(IF(OFFSET($A36,0,1,1,372)=$NL$9,0.5,1)*(OFFSET($A$9,0,1,1,372))))=0,\"\",SUMPRODUCT((OFFSET($A36,0,1,1,372)<>\"\")*(IF(OFFSET($A36,0,1,1,372)=$NL$9,0.5,1)*(OFFSET($A$9,0,1,1,372)))))","v":""},"",null,{"$f":"IF(SUMPRODUCT((OFFSET($A36,0,1,1,372)<>\"\")*(OFFSET($A$9,0,1,1,372))*((OFFSET($A36,0,1,1,372))=NL$5))=0,\"\",SUMPRODUCT((OFFSET($A36,0,1,1,372)<>\"\")*(OFFSET($A$9,0,1,1,372))*((OFFSET($A36,0,1,1,372))=NL$5)))","v":""},{"$f":"IF(SUMPRODUCT((OFFSET($A36,0,1,1,372)<>\"\")*(OFFSET($A$9,0,1,1,372))*((OFFSET($A36,0,1,1,372))=NL$6))=0,\"\",SUMPRODUCT((OFFSET($A36,0,1,1,372)<>\"\")*(OFFSET($A$9,0,1,1,372))*((OFFSET($A36,0,1,1,372))=NL$6)))","v":""},{"$f":"IF(SUMPRODUCT((OFFSET($A36,0,1,1,372)<>\"\")*(OFFSET($A$9,0,1,1,372))*((OFFSET($A36,0,1,1,372))=NL$7))=0,\"\",SUMPRODUCT((OFFSET($A36,0,1,1,372)<>\"\")*(OFFSET($A$9,0,1,1,372))*((OFFSET($A36,0,1,1,372))=NL$7)))","v":""},{"$f":"IF(SUMPRODUCT((OFFSET($A36,0,1,1,372)<>\"\")*(OFFSET($A$9,0,1,1,372))*((OFFSET($A36,0,1,1,372))=NL$8))=0,\"\",SUMPRODUCT((OFFSET($A36,0,1,1,372)<>\"\")*(OFFSET($A$9,0,1,1,372))*((OFFSET($A36,0,1,1,372))=NL$8)))","v":""},{"$f":"IF(SUMPRODUCT((OFFSET($A36,0,1,1,372)<>\"\")*(OFFSET($A$9,0,1,1,372))*((OFFSET($A36,0,1,1,372))=NL$9))=0,\"\",SUMPRODUCT((OFFSET($A36,0,1,1,372)<>\"\")*(OFFSET($A$9,0,1,1,372))*((OFFSET($A36,0,1,1,372))=NL$9)))","v":""}]
[null,null,null,null,null,null,null,null,null,null,null,null,null,null,null,null,null,null,null,null,null,null,null,null,null,null,null,null,null,null,null,null,null,null,null,null,null,null,null,null,null,null,null,null,null,null,null,null,null,null,null,null,null,null,null,null,null,null,null,null,null,null,null,null,null,null,null,null,null,null,null,null,null,null,null,null,null,null,null,null,null,null,null,null,null,null,null,null,null,null,null,null,null,null,null,null,null,null,null,null,null,null,null,null,null,null,null,null,null,null,null,null,null,null,null,null,null,null,null,null,null,null,null,null,null,null,null,null,null,null,null,null,null,null,null,null,null,null,null,null,null,null,null,null,null,null,null,null,null,null,null,null,null,null,null,null,null,null,null,null,null,null,null,null,null,null,null,null,null,null,null,null,null,null,null,null,null,null,null,null,null,null,null,null,null,null,null,null,null,null,null,null,null,null,null,null,null,null,null,null,null,null,null,null,null,null,null,null,null,null,null,null,null,null,null,null,null,null,null,null,null,null,null,null,null,null,null,null,null,null,null,null,null,null,null,null,null,null,null,null,null,null,null,null,null,null,null,null,null,null,null,null,null,null,null,null,null,null,null,null,null,null,null,null,null,null,null,null,null,null,null,null,null,null,null,null,null,null,null,null,null,null,null,null,null,null,null,null,null,null,null,null,null,null,null,null,null,null,null,null,null,null,null,null,null,null,null,null,null,null,null,null,null,null,null,null,null,null,null,null,null,null,null,null,null,null,null,null,null,null,null,null,null,null,null,null,null,null,null,null,null,null,null,null,null,null,null,null,null,null,null,null,null,null,null,null,null,null,null,null,null,null,null,null,null,null,null,null,null,null,null,null,null,null,null,null,null,{"$f":"IF(SUMPRODUCT((OFFSET($A37,0,31*($A$9-1)+1,1,31)<>\"\")*(IF(OFFSET($A37,0,31*($A$9-1)+1,1,31)=$NL$9,0.5,1)*(OFFSET($A$9,0,31*($A$9-1)+1,1,31))))=0,\"\",SUMPRODUCT((OFFSET($A37,0,31*($A$9-1)+1,1,31)<>\"\")*(IF(OFFSET($A37,0,31*($A$9-1)+1,1,31)=$NL$9,0.5,1)*(OFFSET($A$9,0,31*($A$9-1)+1,1,31)))))","v":""},{"$f":"IF(SUMPRODUCT((OFFSET($A37,0,1,1,372)<>\"\")*(IF(OFFSET($A37,0,1,1,372)=$NL$9,0.5,1)*(OFFSET($A$9,0,1,1,372))))=0,\"\",SUMPRODUCT((OFFSET($A37,0,1,1,372)<>\"\")*(IF(OFFSET($A37,0,1,1,372)=$NL$9,0.5,1)*(OFFSET($A$9,0,1,1,372)))))","v":""},"",null,{"$f":"IF(SUMPRODUCT((OFFSET($A37,0,1,1,372)<>\"\")*(OFFSET($A$9,0,1,1,372))*((OFFSET($A37,0,1,1,372))=NL$5))=0,\"\",SUMPRODUCT((OFFSET($A37,0,1,1,372)<>\"\")*(OFFSET($A$9,0,1,1,372))*((OFFSET($A37,0,1,1,372))=NL$5)))","v":""},{"$f":"IF(SUMPRODUCT((OFFSET($A37,0,1,1,372)<>\"\")*(OFFSET($A$9,0,1,1,372))*((OFFSET($A37,0,1,1,372))=NL$6))=0,\"\",SUMPRODUCT((OFFSET($A37,0,1,1,372)<>\"\")*(OFFSET($A$9,0,1,1,372))*((OFFSET($A37,0,1,1,372))=NL$6)))","v":""},{"$f":"IF(SUMPRODUCT((OFFSET($A37,0,1,1,372)<>\"\")*(OFFSET($A$9,0,1,1,372))*((OFFSET($A37,0,1,1,372))=NL$7))=0,\"\",SUMPRODUCT((OFFSET($A37,0,1,1,372)<>\"\")*(OFFSET($A$9,0,1,1,372))*((OFFSET($A37,0,1,1,372))=NL$7)))","v":""},{"$f":"IF(SUMPRODUCT((OFFSET($A37,0,1,1,372)<>\"\")*(OFFSET($A$9,0,1,1,372))*((OFFSET($A37,0,1,1,372))=NL$8))=0,\"\",SUMPRODUCT((OFFSET($A37,0,1,1,372)<>\"\")*(OFFSET($A$9,0,1,1,372))*((OFFSET($A37,0,1,1,372))=NL$8)))","v":""},{"$f":"IF(SUMPRODUCT((OFFSET($A37,0,1,1,372)<>\"\")*(OFFSET($A$9,0,1,1,372))*((OFFSET($A37,0,1,1,372))=NL$9))=0,\"\",SUMPRODUCT((OFFSET($A37,0,1,1,372)<>\"\")*(OFFSET($A$9,0,1,1,372))*((OFFSET($A37,0,1,1,372))=NL$9)))","v":""}]
[null,null,null,null,null,null,null,null,null,null,null,null,null,null,null,null,null,null,null,null,null,null,null,null,null,null,null,null,null,null,null,null,null,null,null,null,null,null,null,null,null,null,null,null,null,null,null,null,null,null,null,null,null,null,null,null,null,null,null,null,null,null,null,null,null,null,null,null,null,null,null,null,null,null,null,null,null,null,null,null,null,null,null,null,null,null,null,null,null,null,null,null,null,null,null,null,null,null,null,null,null,null,null,null,null,null,null,null,null,null,null,null,null,null,null,null,null,null,null,null,null,null,null,null,null,null,null,null,null,null,null,null,null,null,null,null,null,null,null,null,null,null,null,null,null,null,null,null,null,null,null,null,null,null,null,null,null,null,null,null,null,null,null,null,null,null,null,null,null,null,null,null,null,null,null,null,null,null,null,null,null,null,null,null,null,null,null,null,null,null,null,null,null,null,null,null,null,null,null,null,null,null,null,null,null,null,null,null,null,null,null,null,null,null,null,null,null,null,null,null,null,null,null,null,null,null,null,null,null,null,null,null,null,null,null,null,null,null,null,null,null,null,null,null,null,null,null,null,null,null,null,null,null,null,null,null,null,null,null,null,null,null,null,null,null,null,null,null,null,null,null,null,null,null,null,null,null,null,null,null,null,null,null,null,null,null,null,null,null,null,null,null,null,null,null,null,null,null,null,null,null,null,null,null,null,null,null,null,null,null,null,null,null,null,null,null,null,null,null,null,null,null,null,null,null,null,null,null,null,null,null,null,null,null,null,null,null,null,null,null,null,null,null,null,null,null,null,null,null,null,null,null,null,null,null,null,null,null,null,null,null,null,null,null,null,null,null,null,null,null,null,null,null,null,null,null,null,{"$f":"IF(SUMPRODUCT((OFFSET($A38,0,31*($A$9-1)+1,1,31)<>\"\")*(IF(OFFSET($A38,0,31*($A$9-1)+1,1,31)=$NL$9,0.5,1)*(OFFSET($A$9,0,31*($A$9-1)+1,1,31))))=0,\"\",SUMPRODUCT((OFFSET($A38,0,31*($A$9-1)+1,1,31)<>\"\")*(IF(OFFSET($A38,0,31*($A$9-1)+1,1,31)=$NL$9,0.5,1)*(OFFSET($A$9,0,31*($A$9-1)+1,1,31)))))","v":""},{"$f":"IF(SUMPRODUCT((OFFSET($A38,0,1,1,372)<>\"\")*(IF(OFFSET($A38,0,1,1,372)=$NL$9,0.5,1)*(OFFSET($A$9,0,1,1,372))))=0,\"\",SUMPRODUCT((OFFSET($A38,0,1,1,372)<>\"\")*(IF(OFFSET($A38,0,1,1,372)=$NL$9,0.5,1)*(OFFSET($A$9,0,1,1,372)))))","v":""},"",null,{"$f":"IF(SUMPRODUCT((OFFSET($A38,0,1,1,372)<>\"\")*(OFFSET($A$9,0,1,1,372))*((OFFSET($A38,0,1,1,372))=NL$5))=0,\"\",SUMPRODUCT((OFFSET($A38,0,1,1,372)<>\"\")*(OFFSET($A$9,0,1,1,372))*((OFFSET($A38,0,1,1,372))=NL$5)))","v":""},{"$f":"IF(SUMPRODUCT((OFFSET($A38,0,1,1,372)<>\"\")*(OFFSET($A$9,0,1,1,372))*((OFFSET($A38,0,1,1,372))=NL$6))=0,\"\",SUMPRODUCT((OFFSET($A38,0,1,1,372)<>\"\")*(OFFSET($A$9,0,1,1,372))*((OFFSET($A38,0,1,1,372))=NL$6)))","v":""},{"$f":"IF(SUMPRODUCT((OFFSET($A38,0,1,1,372)<>\"\")*(OFFSET($A$9,0,1,1,372))*((OFFSET($A38,0,1,1,372))=NL$7))=0,\"\",SUMPRODUCT((OFFSET($A38,0,1,1,372)<>\"\")*(OFFSET($A$9,0,1,1,372))*((OFFSET($A38,0,1,1,372))=NL$7)))","v":""},{"$f":"IF(SUMPRODUCT((OFFSET($A38,0,1,1,372)<>\"\")*(OFFSET($A$9,0,1,1,372))*((OFFSET($A38,0,1,1,372))=NL$8))=0,\"\",SUMPRODUCT((OFFSET($A38,0,1,1,372)<>\"\")*(OFFSET($A$9,0,1,1,372))*((OFFSET($A38,0,1,1,372))=NL$8)))","v":""},{"$f":"IF(SUMPRODUCT((OFFSET($A38,0,1,1,372)<>\"\")*(OFFSET($A$9,0,1,1,372))*((OFFSET($A38,0,1,1,372))=NL$9))=0,\"\",SUMPRODUCT((OFFSET($A38,0,1,1,372)<>\"\")*(OFFSET($A$9,0,1,1,372))*((OFFSET($A38,0,1,1,372))=NL$9)))","v":""}]
[null,null,null,null,null,null,null,null,null,null,null,null,null,null,null,null,null,null,null,null,null,null,null,null,null,null,null,null,null,null,null,null,null,null,null,null,null,null,null,null,null,null,null,null,null,null,null,null,null,null,null,null,null,null,null,null,null,null,null,null,null,null,null,null,null,null,null,null,null,null,null,null,null,null,null,null,null,null,null,null,null,null,null,null,null,null,null,null,null,null,null,null,null,null,null,null,null,null,null,null,null,null,null,null,null,null,null,null,null,null,null,null,null,null,null,null,null,null,null,null,null,null,null,null,null,null,null,null,null,null,null,null,null,null,null,null,null,null,null,null,null,null,null,null,null,null,null,null,null,null,null,null,null,null,null,null,null,null,null,null,null,null,null,null,null,null,null,null,null,null,null,null,null,null,null,null,null,null,null,null,null,null,null,null,null,null,null,null,null,null,null,null,null,null,null,null,null,null,null,null,null,null,null,null,null,null,null,null,null,null,null,null,null,null,null,null,null,null,null,null,null,null,null,null,null,null,null,null,null,null,null,null,null,null,null,null,null,null,null,null,null,null,null,null,null,null,null,null,null,null,null,null,null,null,null,null,null,null,null,null,null,null,null,null,null,null,null,null,null,null,null,null,null,null,null,null,null,null,null,null,null,null,null,null,null,null,null,null,null,null,null,null,null,null,null,null,null,null,null,null,null,null,null,null,null,null,null,null,null,null,null,null,null,null,null,null,null,null,null,null,null,null,null,null,null,null,null,null,null,null,null,null,null,null,null,null,null,null,null,null,null,null,null,null,null,null,null,null,null,null,null,null,null,null,null,null,null,null,null,null,null,null,null,null,null,null,null,null,null,null,null,null,null,null,null,null,null,{"$f":"IF(SUMPRODUCT((OFFSET($A39,0,31*($A$9-1)+1,1,31)<>\"\")*(IF(OFFSET($A39,0,31*($A$9-1)+1,1,31)=$NL$9,0.5,1)*(OFFSET($A$9,0,31*($A$9-1)+1,1,31))))=0,\"\",SUMPRODUCT((OFFSET($A39,0,31*($A$9-1)+1,1,31)<>\"\")*(IF(OFFSET($A39,0,31*($A$9-1)+1,1,31)=$NL$9,0.5,1)*(OFFSET($A$9,0,31*($A$9-1)+1,1,31)))))","v":""},{"$f":"IF(SUMPRODUCT((OFFSET($A39,0,1,1,372)<>\"\")*(IF(OFFSET($A39,0,1,1,372)=$NL$9,0.5,1)*(OFFSET($A$9,0,1,1,372))))=0,\"\",SUMPRODUCT((OFFSET($A39,0,1,1,372)<>\"\")*(IF(OFFSET($A39,0,1,1,372)=$NL$9,0.5,1)*(OFFSET($A$9,0,1,1,372)))))","v":""},"",null,{"$f":"IF(SUMPRODUCT((OFFSET($A39,0,1,1,372)<>\"\")*(OFFSET($A$9,0,1,1,372))*((OFFSET($A39,0,1,1,372))=NL$5))=0,\"\",SUMPRODUCT((OFFSET($A39,0,1,1,372)<>\"\")*(OFFSET($A$9,0,1,1,372))*((OFFSET($A39,0,1,1,372))=NL$5)))","v":""},{"$f":"IF(SUMPRODUCT((OFFSET($A39,0,1,1,372)<>\"\")*(OFFSET($A$9,0,1,1,372))*((OFFSET($A39,0,1,1,372))=NL$6))=0,\"\",SUMPRODUCT((OFFSET($A39,0,1,1,372)<>\"\")*(OFFSET($A$9,0,1,1,372))*((OFFSET($A39,0,1,1,372))=NL$6)))","v":""},{"$f":"IF(SUMPRODUCT((OFFSET($A39,0,1,1,372)<>\"\")*(OFFSET($A$9,0,1,1,372))*((OFFSET($A39,0,1,1,372))=NL$7))=0,\"\",SUMPRODUCT((OFFSET($A39,0,1,1,372)<>\"\")*(OFFSET($A$9,0,1,1,372))*((OFFSET($A39,0,1,1,372))=NL$7)))","v":""},{"$f":"IF(SUMPRODUCT((OFFSET($A39,0,1,1,372)<>\"\")*(OFFSET($A$9,0,1,1,372))*((OFFSET($A39,0,1,1,372))=NL$8))=0,\"\",SUMPRODUCT((OFFSET($A39,0,1,1,372)<>\"\")*(OFFSET($A$9,0,1,1,372))*((OFFSET($A39,0,1,1,372))=NL$8)))","v":""},{"$f":"IF(SUMPRODUCT((OFFSET($A39,0,1,1,372)<>\"\")*(OFFSET($A$9,0,1,1,372))*((OFFSET($A39,0,1,1,372))=NL$9))=0,\"\",SUMPRODUCT((OFFSET($A39,0,1,1,372)<>\"\")*(OFFSET($A$9,0,1,1,372))*((OFFSET($A39,0,1,1,372))=NL$9)))","v":""}]
[null,null,null,null,null,null,null,null,null,null,null,null,null,null,null,null,null,null,null,null,null,null,null,null,null,null,null,null,null,null,null,null,null,null,null,null,null,null,null,null,null,null,null,null,null,null,null,null,null,null,null,null,null,null,null,null,null,null,null,null,null,null,null,null,null,null,null,null,null,null,null,null,null,null,null,null,null,null,null,null,null,null,null,null,null,null,null,null,null,null,null,null,null,null,null,null,null,null,null,null,null,null,null,null,null,null,null,null,null,null,null,null,null,null,null,null,null,null,null,null,null,null,null,null,null,null,null,null,null,null,null,null,null,null,null,null,null,null,null,null,null,null,null,null,null,null,null,null,null,null,null,null,null,null,null,null,null,null,null,null,null,null,null,null,null,null,null,null,null,null,null,null,null,null,null,null,null,null,null,null,null,null,null,null,null,null,null,null,null,null,null,null,null,null,null,null,null,null,null,null,null,null,null,null,null,null,null,null,null,null,null,null,null,null,null,null,null,null,null,null,null,null,null,null,null,null,null,null,null,null,null,null,null,null,null,null,null,null,null,null,null,null,null,null,null,null,null,null,null,null,null,null,null,null,null,null,null,null,null,null,null,null,null,null,null,null,null,null,null,null,null,null,null,null,null,null,null,null,null,null,null,null,null,null,null,null,null,null,null,null,null,null,null,null,null,null,null,null,null,null,null,null,null,null,null,null,null,null,null,null,null,null,null,null,null,null,null,null,null,null,null,null,null,null,null,null,null,null,null,null,null,null,null,null,null,null,null,null,null,null,null,null,null,null,null,null,null,null,null,null,null,null,null,null,null,null,null,null,null,null,null,null,null,null,null,null,null,null,null,null,null,null,null,null,null,null,null,{"$f":"IF(SUMPRODUCT((OFFSET($A40,0,31*($A$9-1)+1,1,31)<>\"\")*(IF(OFFSET($A40,0,31*($A$9-1)+1,1,31)=$NL$9,0.5,1)*(OFFSET($A$9,0,31*($A$9-1)+1,1,31))))=0,\"\",SUMPRODUCT((OFFSET($A40,0,31*($A$9-1)+1,1,31)<>\"\")*(IF(OFFSET($A40,0,31*($A$9-1)+1,1,31)=$NL$9,0.5,1)*(OFFSET($A$9,0,31*($A$9-1)+1,1,31)))))","v":""},{"$f":"IF(SUMPRODUCT((OFFSET($A40,0,1,1,372)<>\"\")*(IF(OFFSET($A40,0,1,1,372)=$NL$9,0.5,1)*(OFFSET($A$9,0,1,1,372))))=0,\"\",SUMPRODUCT((OFFSET($A40,0,1,1,372)<>\"\")*(IF(OFFSET($A40,0,1,1,372)=$NL$9,0.5,1)*(OFFSET($A$9,0,1,1,372)))))","v":""},"",null,{"$f":"IF(SUMPRODUCT((OFFSET($A40,0,1,1,372)<>\"\")*(OFFSET($A$9,0,1,1,372))*((OFFSET($A40,0,1,1,372))=NL$5))=0,\"\",SUMPRODUCT((OFFSET($A40,0,1,1,372)<>\"\")*(OFFSET($A$9,0,1,1,372))*((OFFSET($A40,0,1,1,372))=NL$5)))","v":""},{"$f":"IF(SUMPRODUCT((OFFSET($A40,0,1,1,372)<>\"\")*(OFFSET($A$9,0,1,1,372))*((OFFSET($A40,0,1,1,372))=NL$6))=0,\"\",SUMPRODUCT((OFFSET($A40,0,1,1,372)<>\"\")*(OFFSET($A$9,0,1,1,372))*((OFFSET($A40,0,1,1,372))=NL$6)))","v":""},{"$f":"IF(SUMPRODUCT((OFFSET($A40,0,1,1,372)<>\"\")*(OFFSET($A$9,0,1,1,372))*((OFFSET($A40,0,1,1,372))=NL$7))=0,\"\",SUMPRODUCT((OFFSET($A40,0,1,1,372)<>\"\")*(OFFSET($A$9,0,1,1,372))*((OFFSET($A40,0,1,1,372))=NL$7)))","v":""},{"$f":"IF(SUMPRODUCT((OFFSET($A40,0,1,1,372)<>\"\")*(OFFSET($A$9,0,1,1,372))*((OFFSET($A40,0,1,1,372))=NL$8))=0,\"\",SUMPRODUCT((OFFSET($A40,0,1,1,372)<>\"\")*(OFFSET($A$9,0,1,1,372))*((OFFSET($A40,0,1,1,372))=NL$8)))","v":""},{"$f":"IF(SUMPRODUCT((OFFSET($A40,0,1,1,372)<>\"\")*(OFFSET($A$9,0,1,1,372))*((OFFSET($A40,0,1,1,372))=NL$9))=0,\"\",SUMPRODUCT((OFFSET($A40,0,1,1,372)<>\"\")*(OFFSET($A$9,0,1,1,372))*((OFFSET($A40,0,1,1,372))=NL$9)))","v":""}]
[null,null,null,null,null,null,null,null,null,null,null,null,null,null,null,null,null,null,null,null,null,null,null,null,null,null,null,null,null,null,null,null,null,null,null,null,null,null,null,null,null,null,null,null,null,null,null,null,null,null,null,null,null,null,null,null,null,null,null,null,null,null,null,null,null,null,null,null,null,null,null,null,null,null,null,null,null,null,null,null,null,null,null,null,null,null,null,null,null,null,null,null,null,null,null,null,null,null,null,null,null,null,null,null,null,null,null,null,null,null,null,null,null,null,null,null,null,null,null,null,null,null,null,null,null,null,null,null,null,null,null,null,null,null,null,null,null,null,null,null,null,null,null,null,null,null,null,null,null,null,null,null,null,null,null,null,null,null,null,null,null,null,null,null,null,null,null,null,null,null,null,null,null,null,null,null,null,null,null,null,null,null,null,null,null,null,null,null,null,null,null,null,null,null,null,null,null,null,null,null,null,null,null,null,null,null,null,null,null,null,null,null,null,null,null,null,null,null,null,null,null,null,null,null,null,null,null,null,null,null,null,null,null,null,null,null,null,null,null,null,null,null,null,null,null,null,null,null,null,null,null,null,null,null,null,null,null,null,null,null,null,null,null,null,null,null,null,null,null,null,null,null,null,null,null,null,null,null,null,null,null,null,null,null,null,null,null,null,null,null,null,null,null,null,null,null,null,null,null,null,null,null,null,null,null,null,null,null,null,null,null,null,null,null,null,null,null,null,null,null,null,null,null,null,null,null,null,null,null,null,null,null,null,null,null,null,null,null,null,null,null,null,null,null,null,null,null,null,null,null,null,null,null,null,null,null,null,null,null,null,null,null,null,null,null,null,null,null,null,null,null,null,null,null,null,null,null,{"$f":"IF(SUMPRODUCT((OFFSET($A41,0,31*($A$9-1)+1,1,31)<>\"\")*(IF(OFFSET($A41,0,31*($A$9-1)+1,1,31)=$NL$9,0.5,1)*(OFFSET($A$9,0,31*($A$9-1)+1,1,31))))=0,\"\",SUMPRODUCT((OFFSET($A41,0,31*($A$9-1)+1,1,31)<>\"\")*(IF(OFFSET($A41,0,31*($A$9-1)+1,1,31)=$NL$9,0.5,1)*(OFFSET($A$9,0,31*($A$9-1)+1,1,31)))))","v":""},{"$f":"IF(SUMPRODUCT((OFFSET($A41,0,1,1,372)<>\"\")*(IF(OFFSET($A41,0,1,1,372)=$NL$9,0.5,1)*(OFFSET($A$9,0,1,1,372))))=0,\"\",SUMPRODUCT((OFFSET($A41,0,1,1,372)<>\"\")*(IF(OFFSET($A41,0,1,1,372)=$NL$9,0.5,1)*(OFFSET($A$9,0,1,1,372)))))","v":""},"",null,{"$f":"IF(SUMPRODUCT((OFFSET($A41,0,1,1,372)<>\"\")*(OFFSET($A$9,0,1,1,372))*((OFFSET($A41,0,1,1,372))=NL$5))=0,\"\",SUMPRODUCT((OFFSET($A41,0,1,1,372)<>\"\")*(OFFSET($A$9,0,1,1,372))*((OFFSET($A41,0,1,1,372))=NL$5)))","v":""},{"$f":"IF(SUMPRODUCT((OFFSET($A41,0,1,1,372)<>\"\")*(OFFSET($A$9,0,1,1,372))*((OFFSET($A41,0,1,1,372))=NL$6))=0,\"\",SUMPRODUCT((OFFSET($A41,0,1,1,372)<>\"\")*(OFFSET($A$9,0,1,1,372))*((OFFSET($A41,0,1,1,372))=NL$6)))","v":""},{"$f":"IF(SUMPRODUCT((OFFSET($A41,0,1,1,372)<>\"\")*(OFFSET($A$9,0,1,1,372))*((OFFSET($A41,0,1,1,372))=NL$7))=0,\"\",SUMPRODUCT((OFFSET($A41,0,1,1,372)<>\"\")*(OFFSET($A$9,0,1,1,372))*((OFFSET($A41,0,1,1,372))=NL$7)))","v":""},{"$f":"IF(SUMPRODUCT((OFFSET($A41,0,1,1,372)<>\"\")*(OFFSET($A$9,0,1,1,372))*((OFFSET($A41,0,1,1,372))=NL$8))=0,\"\",SUMPRODUCT((OFFSET($A41,0,1,1,372)<>\"\")*(OFFSET($A$9,0,1,1,372))*((OFFSET($A41,0,1,1,372))=NL$8)))","v":""},{"$f":"IF(SUMPRODUCT((OFFSET($A41,0,1,1,372)<>\"\")*(OFFSET($A$9,0,1,1,372))*((OFFSET($A41,0,1,1,372))=NL$9))=0,\"\",SUMPRODUCT((OFFSET($A41,0,1,1,372)<>\"\")*(OFFSET($A$9,0,1,1,372))*((OFFSET($A41,0,1,1,372))=NL$9)))","v":""}]
[null,null,null,null,null,null,null,null,null,null,null,null,null,null,null,null,null,null,null,null,null,null,null,null,null,null,null,null,null,null,null,null,null,null,null,null,null,null,null,null,null,null,null,null,null,null,null,null,null,null,null,null,null,null,null,null,null,null,null,null,null,null,null,null,null,null,null,null,null,null,null,null,null,null,null,null,null,null,null,null,null,null,null,null,null,null,null,null,null,null,null,null,null,null,null,null,null,null,null,null,null,null,null,null,null,null,null,null,null,null,null,null,null,null,null,null,null,null,null,null,null,null,null,null,null,null,null,null,null,null,null,null,null,null,null,null,null,null,null,null,null,null,null,null,null,null,null,null,null,null,null,null,null,null,null,null,null,null,null,null,null,null,null,null,null,null,null,null,null,null,null,null,null,null,null,null,null,null,null,null,null,null,null,null,null,null,null,null,null,null,null,null,null,null,null,null,null,null,null,null,null,null,null,null,null,null,null,null,null,null,null,null,null,null,null,null,null,null,null,null,null,null,null,null,null,null,null,null,null,null,null,null,null,null,null,null,null,null,null,null,null,null,null,null,null,null,null,null,null,null,null,null,null,null,null,null,null,null,null,null,null,null,null,null,null,null,null,null,null,null,null,null,null,null,null,null,null,null,null,null,null,null,null,null,null,null,null,null,null,null,null,null,null,null,null,null,null,null,null,null,null,null,null,null,null,null,null,null,null,null,null,null,null,null,null,null,null,null,null,null,null,null,null,null,null,null,null,null,null,null,null,null,null,null,null,null,null,null,null,null,null,null,null,null,null,null,null,null,null,null,null,null,null,null,null,null,null,null,null,null,null,null,null,null,null,null,null,null,null,null,null,null,null,null,null,null,null,{"$f":"IF(SUMPRODUCT((OFFSET($A42,0,31*($A$9-1)+1,1,31)<>\"\")*(IF(OFFSET($A42,0,31*($A$9-1)+1,1,31)=$NL$9,0.5,1)*(OFFSET($A$9,0,31*($A$9-1)+1,1,31))))=0,\"\",SUMPRODUCT((OFFSET($A42,0,31*($A$9-1)+1,1,31)<>\"\")*(IF(OFFSET($A42,0,31*($A$9-1)+1,1,31)=$NL$9,0.5,1)*(OFFSET($A$9,0,31*($A$9-1)+1,1,31)))))","v":""},{"$f":"IF(SUMPRODUCT((OFFSET($A42,0,1,1,372)<>\"\")*(IF(OFFSET($A42,0,1,1,372)=$NL$9,0.5,1)*(OFFSET($A$9,0,1,1,372))))=0,\"\",SUMPRODUCT((OFFSET($A42,0,1,1,372)<>\"\")*(IF(OFFSET($A42,0,1,1,372)=$NL$9,0.5,1)*(OFFSET($A$9,0,1,1,372)))))","v":""},"",null,{"$f":"IF(SUMPRODUCT((OFFSET($A42,0,1,1,372)<>\"\")*(OFFSET($A$9,0,1,1,372))*((OFFSET($A42,0,1,1,372))=NL$5))=0,\"\",SUMPRODUCT((OFFSET($A42,0,1,1,372)<>\"\")*(OFFSET($A$9,0,1,1,372))*((OFFSET($A42,0,1,1,372))=NL$5)))","v":""},{"$f":"IF(SUMPRODUCT((OFFSET($A42,0,1,1,372)<>\"\")*(OFFSET($A$9,0,1,1,372))*((OFFSET($A42,0,1,1,372))=NL$6))=0,\"\",SUMPRODUCT((OFFSET($A42,0,1,1,372)<>\"\")*(OFFSET($A$9,0,1,1,372))*((OFFSET($A42,0,1,1,372))=NL$6)))","v":""},{"$f":"IF(SUMPRODUCT((OFFSET($A42,0,1,1,372)<>\"\")*(OFFSET($A$9,0,1,1,372))*((OFFSET($A42,0,1,1,372))=NL$7))=0,\"\",SUMPRODUCT((OFFSET($A42,0,1,1,372)<>\"\")*(OFFSET($A$9,0,1,1,372))*((OFFSET($A42,0,1,1,372))=NL$7)))","v":""},{"$f":"IF(SUMPRODUCT((OFFSET($A42,0,1,1,372)<>\"\")*(OFFSET($A$9,0,1,1,372))*((OFFSET($A42,0,1,1,372))=NL$8))=0,\"\",SUMPRODUCT((OFFSET($A42,0,1,1,372)<>\"\")*(OFFSET($A$9,0,1,1,372))*((OFFSET($A42,0,1,1,372))=NL$8)))","v":""},{"$f":"IF(SUMPRODUCT((OFFSET($A42,0,1,1,372)<>\"\")*(OFFSET($A$9,0,1,1,372))*((OFFSET($A42,0,1,1,372))=NL$9))=0,\"\",SUMPRODUCT((OFFSET($A42,0,1,1,372)<>\"\")*(OFFSET($A$9,0,1,1,372))*((OFFSET($A42,0,1,1,372))=NL$9)))","v":""}]
[null,null,null,null,null,null,null,null,null,null,null,null,null,null,null,null,null,null,null,null,null,null,null,null,null,null,null,null,null,null,null,null,null,null,null,null,null,null,null,null,null,null,null,null,null,null,null,null,null,null,null,null,null,null,null,null,null,null,null,null,null,null,null,null,null,null,null,null,null,null,null,null,null,null,null,null,null,null,null,null,null,null,null,null,null,null,null,null,null,null,null,null,null,null,null,null,null,null,null,null,null,null,null,null,null,null,null,null,null,null,null,null,null,null,null,null,null,null,null,null,null,null,null,null,null,null,null,null,null,null,null,null,null,null,null,null,null,null,null,null,null,null,null,null,null,null,null,null,null,null,null,null,null,null,null,null,null,null,null,null,null,null,null,null,null,null,null,null,null,null,null,null,null,null,null,null,null,null,null,null,null,null,null,null,null,null,null,null,null,null,null,null,null,null,null,null,null,null,null,null,null,null,null,null,null,null,null,null,null,null,null,null,null,null,null,null,null,null,null,null,null,null,null,null,null,null,null,null,null,null,null,null,null,null,null,null,null,null,null,null,null,null,null,null,null,null,null,null,null,null,null,null,null,null,null,null,null,null,null,null,null,null,null,null,null,null,null,null,null,null,null,null,null,null,null,null,null,null,null,null,null,null,null,null,null,null,null,null,null,null,null,null,null,null,null,null,null,null,null,null,null,null,null,null,null,null,null,null,null,null,null,null,null,null,null,null,null,null,null,null,null,null,null,null,null,null,null,null,null,null,null,null,null,null,null,null,null,null,null,null,null,null,null,null,null,null,null,null,null,null,null,null,null,null,null,null,null,null,null,null,null,null,null,null,null,null,null,null,null,null,null,null,null,null,null,null,null,{"$f":"IF(SUMPRODUCT((OFFSET($A43,0,31*($A$9-1)+1,1,31)<>\"\")*(IF(OFFSET($A43,0,31*($A$9-1)+1,1,31)=$NL$9,0.5,1)*(OFFSET($A$9,0,31*($A$9-1)+1,1,31))))=0,\"\",SUMPRODUCT((OFFSET($A43,0,31*($A$9-1)+1,1,31)<>\"\")*(IF(OFFSET($A43,0,31*($A$9-1)+1,1,31)=$NL$9,0.5,1)*(OFFSET($A$9,0,31*($A$9-1)+1,1,31)))))","v":""},{"$f":"IF(SUMPRODUCT((OFFSET($A43,0,1,1,372)<>\"\")*(IF(OFFSET($A43,0,1,1,372)=$NL$9,0.5,1)*(OFFSET($A$9,0,1,1,372))))=0,\"\",SUMPRODUCT((OFFSET($A43,0,1,1,372)<>\"\")*(IF(OFFSET($A43,0,1,1,372)=$NL$9,0.5,1)*(OFFSET($A$9,0,1,1,372)))))","v":""},"",null,{"$f":"IF(SUMPRODUCT((OFFSET($A43,0,1,1,372)<>\"\")*(OFFSET($A$9,0,1,1,372))*((OFFSET($A43,0,1,1,372))=NL$5))=0,\"\",SUMPRODUCT((OFFSET($A43,0,1,1,372)<>\"\")*(OFFSET($A$9,0,1,1,372))*((OFFSET($A43,0,1,1,372))=NL$5)))","v":""},{"$f":"IF(SUMPRODUCT((OFFSET($A43,0,1,1,372)<>\"\")*(OFFSET($A$9,0,1,1,372))*((OFFSET($A43,0,1,1,372))=NL$6))=0,\"\",SUMPRODUCT((OFFSET($A43,0,1,1,372)<>\"\")*(OFFSET($A$9,0,1,1,372))*((OFFSET($A43,0,1,1,372))=NL$6)))","v":""},{"$f":"IF(SUMPRODUCT((OFFSET($A43,0,1,1,372)<>\"\")*(OFFSET($A$9,0,1,1,372))*((OFFSET($A43,0,1,1,372))=NL$7))=0,\"\",SUMPRODUCT((OFFSET($A43,0,1,1,372)<>\"\")*(OFFSET($A$9,0,1,1,372))*((OFFSET($A43,0,1,1,372))=NL$7)))","v":""},{"$f":"IF(SUMPRODUCT((OFFSET($A43,0,1,1,372)<>\"\")*(OFFSET($A$9,0,1,1,372))*((OFFSET($A43,0,1,1,372))=NL$8))=0,\"\",SUMPRODUCT((OFFSET($A43,0,1,1,372)<>\"\")*(OFFSET($A$9,0,1,1,372))*((OFFSET($A43,0,1,1,372))=NL$8)))","v":""},{"$f":"IF(SUMPRODUCT((OFFSET($A43,0,1,1,372)<>\"\")*(OFFSET($A$9,0,1,1,372))*((OFFSET($A43,0,1,1,372))=NL$9))=0,\"\",SUMPRODUCT((OFFSET($A43,0,1,1,372)<>\"\")*(OFFSET($A$9,0,1,1,372))*((OFFSET($A43,0,1,1,372))=NL$9)))","v":""}]
[null,null,null,null,null,null,null,null,null,null,null,null,null,null,null,null,null,null,null,null,null,null,null,null,null,null,null,null,null,null,null,null,null,null,null,null,null,null,null,null,null,null,null,null,null,null,null,null,null,null,null,null,null,null,null,null,null,null,null,null,null,null,null,null,null,null,null,null,null,null,null,null,null,null,null,null,null,null,null,null,null,null,null,null,null,null,null,null,null,null,null,null,null,null,null,null,null,null,null,null,null,null,null,null,null,null,null,null,null,null,null,null,null,null,null,null,null,null,null,null,null,null,null,null,null,null,null,null,null,null,null,null,null,null,null,null,null,null,null,null,null,null,null,null,null,null,null,null,null,null,null,null,null,null,null,null,null,null,null,null,null,null,null,null,null,null,null,null,null,null,null,null,null,null,null,null,null,null,null,null,null,null,null,null,null,null,null,null,null,null,null,null,null,null,null,null,null,null,null,null,null,null,null,null,null,null,null,null,null,null,null,null,null,null,null,null,null,null,null,null,null,null,null,null,null,null,null,null,null,null,null,null,null,null,null,null,null,null,null,null,null,null,null,null,null,null,null,null,null,null,null,null,null,null,null,null,null,null,null,null,null,null,null,null,null,null,null,null,null,null,null,null,null,null,null,null,null,null,null,null,null,null,null,null,null,null,null,null,null,null,null,null,null,null,null,null,null,null,null,null,null,null,null,null,null,null,null,null,null,null,null,null,null,null,null,null,null,null,null,null,null,null,null,null,null,null,null,null,null,null,null,null,null,null,null,null,null,null,null,null,null,null,null,null,null,null,null,null,null,null,null,null,null,null,null,null,null,null,null,null,null,null,null,null,null,null,null,null,null,null,null,null,null,null,null,null,null,{"$f":"IF(SUMPRODUCT((OFFSET($A44,0,31*($A$9-1)+1,1,31)<>\"\")*(IF(OFFSET($A44,0,31*($A$9-1)+1,1,31)=$NL$9,0.5,1)*(OFFSET($A$9,0,31*($A$9-1)+1,1,31))))=0,\"\",SUMPRODUCT((OFFSET($A44,0,31*($A$9-1)+1,1,31)<>\"\")*(IF(OFFSET($A44,0,31*($A$9-1)+1,1,31)=$NL$9,0.5,1)*(OFFSET($A$9,0,31*($A$9-1)+1,1,31)))))","v":""},{"$f":"IF(SUMPRODUCT((OFFSET($A44,0,1,1,372)<>\"\")*(IF(OFFSET($A44,0,1,1,372)=$NL$9,0.5,1)*(OFFSET($A$9,0,1,1,372))))=0,\"\",SUMPRODUCT((OFFSET($A44,0,1,1,372)<>\"\")*(IF(OFFSET($A44,0,1,1,372)=$NL$9,0.5,1)*(OFFSET($A$9,0,1,1,372)))))","v":""},"",null,{"$f":"IF(SUMPRODUCT((OFFSET($A44,0,1,1,372)<>\"\")*(OFFSET($A$9,0,1,1,372))*((OFFSET($A44,0,1,1,372))=NL$5))=0,\"\",SUMPRODUCT((OFFSET($A44,0,1,1,372)<>\"\")*(OFFSET($A$9,0,1,1,372))*((OFFSET($A44,0,1,1,372))=NL$5)))","v":""},{"$f":"IF(SUMPRODUCT((OFFSET($A44,0,1,1,372)<>\"\")*(OFFSET($A$9,0,1,1,372))*((OFFSET($A44,0,1,1,372))=NL$6))=0,\"\",SUMPRODUCT((OFFSET($A44,0,1,1,372)<>\"\")*(OFFSET($A$9,0,1,1,372))*((OFFSET($A44,0,1,1,372))=NL$6)))","v":""},{"$f":"IF(SUMPRODUCT((OFFSET($A44,0,1,1,372)<>\"\")*(OFFSET($A$9,0,1,1,372))*((OFFSET($A44,0,1,1,372))=NL$7))=0,\"\",SUMPRODUCT((OFFSET($A44,0,1,1,372)<>\"\")*(OFFSET($A$9,0,1,1,372))*((OFFSET($A44,0,1,1,372))=NL$7)))","v":""},{"$f":"IF(SUMPRODUCT((OFFSET($A44,0,1,1,372)<>\"\")*(OFFSET($A$9,0,1,1,372))*((OFFSET($A44,0,1,1,372))=NL$8))=0,\"\",SUMPRODUCT((OFFSET($A44,0,1,1,372)<>\"\")*(OFFSET($A$9,0,1,1,372))*((OFFSET($A44,0,1,1,372))=NL$8)))","v":""},{"$f":"IF(SUMPRODUCT((OFFSET($A44,0,1,1,372)<>\"\")*(OFFSET($A$9,0,1,1,372))*((OFFSET($A44,0,1,1,372))=NL$9))=0,\"\",SUMPRODUCT((OFFSET($A44,0,1,1,372)<>\"\")*(OFFSET($A$9,0,1,1,372))*((OFFSET($A44,0,1,1,372))=NL$9)))","v":""}]
[null,null,null,null,null,null,null,null,null,null,null,null,null,null,null,null,null,null,null,null,null,null,null,null,null,null,null,null,null,null,null,null,null,null,null,null,null,null,null,null,null,null,null,null,null,null,null,null,null,null,null,null,null,null,null,null,null,null,null,null,null,null,null,null,null,null,null,null,null,null,null,null,null,null,null,null,null,null,null,null,null,null,null,null,null,null,null,null,null,null,null,null,null,null,null,null,null,null,null,null,null,null,null,null,null,null,null,null,null,null,null,null,null,null,null,null,null,null,null,null,null,null,null,null,null,null,null,null,null,null,null,null,null,null,null,null,null,null,null,null,null,null,null,null,null,null,null,null,null,null,null,null,null,null,null,null,null,null,null,null,null,null,null,null,null,null,null,null,null,null,null,null,null,null,null,null,null,null,null,null,null,null,null,null,null,null,null,null,null,null,null,null,null,null,null,null,null,null,null,null,null,null,null,null,null,null,null,null,null,null,null,null,null,null,null,null,null,null,null,null,null,null,null,null,null,null,null,null,null,null,null,null,null,null,null,null,null,null,null,null,null,null,null,null,null,null,null,null,null,null,null,null,null,null,null,null,null,null,null,null,null,null,null,null,null,null,null,null,null,null,null,null,null,null,null,null,null,null,null,null,null,null,null,null,null,null,null,null,null,null,null,null,null,null,null,null,null,null,null,null,null,null,null,null,null,null,null,null,null,null,null,null,null,null,null,null,null,null,null,null,null,null,null,null,null,null,null,null,null,null,null,null,null,null,null,null,null,null,null,null,null,null,null,null,null,null,null,null,null,null,null,null,null,null,null,null,null,null,null,null,null,null,null,null,null,null,null,null,null,null,null,null,null,null,null,null,null,{"$f":"IF(SUMPRODUCT((OFFSET($A45,0,31*($A$9-1)+1,1,31)<>\"\")*(IF(OFFSET($A45,0,31*($A$9-1)+1,1,31)=$NL$9,0.5,1)*(OFFSET($A$9,0,31*($A$9-1)+1,1,31))))=0,\"\",SUMPRODUCT((OFFSET($A45,0,31*($A$9-1)+1,1,31)<>\"\")*(IF(OFFSET($A45,0,31*($A$9-1)+1,1,31)=$NL$9,0.5,1)*(OFFSET($A$9,0,31*($A$9-1)+1,1,31)))))","v":""},{"$f":"IF(SUMPRODUCT((OFFSET($A45,0,1,1,372)<>\"\")*(IF(OFFSET($A45,0,1,1,372)=$NL$9,0.5,1)*(OFFSET($A$9,0,1,1,372))))=0,\"\",SUMPRODUCT((OFFSET($A45,0,1,1,372)<>\"\")*(IF(OFFSET($A45,0,1,1,372)=$NL$9,0.5,1)*(OFFSET($A$9,0,1,1,372)))))","v":""},"",null,{"$f":"IF(SUMPRODUCT((OFFSET($A45,0,1,1,372)<>\"\")*(OFFSET($A$9,0,1,1,372))*((OFFSET($A45,0,1,1,372))=NL$5))=0,\"\",SUMPRODUCT((OFFSET($A45,0,1,1,372)<>\"\")*(OFFSET($A$9,0,1,1,372))*((OFFSET($A45,0,1,1,372))=NL$5)))","v":""},{"$f":"IF(SUMPRODUCT((OFFSET($A45,0,1,1,372)<>\"\")*(OFFSET($A$9,0,1,1,372))*((OFFSET($A45,0,1,1,372))=NL$6))=0,\"\",SUMPRODUCT((OFFSET($A45,0,1,1,372)<>\"\")*(OFFSET($A$9,0,1,1,372))*((OFFSET($A45,0,1,1,372))=NL$6)))","v":""},{"$f":"IF(SUMPRODUCT((OFFSET($A45,0,1,1,372)<>\"\")*(OFFSET($A$9,0,1,1,372))*((OFFSET($A45,0,1,1,372))=NL$7))=0,\"\",SUMPRODUCT((OFFSET($A45,0,1,1,372)<>\"\")*(OFFSET($A$9,0,1,1,372))*((OFFSET($A45,0,1,1,372))=NL$7)))","v":""},{"$f":"IF(SUMPRODUCT((OFFSET($A45,0,1,1,372)<>\"\")*(OFFSET($A$9,0,1,1,372))*((OFFSET($A45,0,1,1,372))=NL$8))=0,\"\",SUMPRODUCT((OFFSET($A45,0,1,1,372)<>\"\")*(OFFSET($A$9,0,1,1,372))*((OFFSET($A45,0,1,1,372))=NL$8)))","v":""},{"$f":"IF(SUMPRODUCT((OFFSET($A45,0,1,1,372)<>\"\")*(OFFSET($A$9,0,1,1,372))*((OFFSET($A45,0,1,1,372))=NL$9))=0,\"\",SUMPRODUCT((OFFSET($A45,0,1,1,372)<>\"\")*(OFFSET($A$9,0,1,1,372))*((OFFSET($A45,0,1,1,372))=NL$9)))","v":""}]
[null,null,null,null,null,null,null,null,null,null,null,null,null,null,null,null,null,null,null,null,null,null,null,null,null,null,null,null,null,null,null,null,null,null,null,null,null,null,null,null,null,null,null,null,null,null,null,null,null,null,null,null,null,null,null,null,null,null,null,null,null,null,null,null,null,null,null,null,null,null,null,null,null,null,null,null,null,null,null,null,null,null,null,null,null,null,null,null,null,null,null,null,null,null,null,null,null,null,null,null,null,null,null,null,null,null,null,null,null,null,null,null,null,null,null,null,null,null,null,null,null,null,null,null,null,null,null,null,null,null,null,null,null,null,null,null,null,null,null,null,null,null,null,null,null,null,null,null,null,null,null,null,null,null,null,null,null,null,null,null,null,null,null,null,null,null,null,null,null,null,null,null,null,null,null,null,null,null,null,null,null,null,null,null,null,null,null,null,null,null,null,null,null,null,null,null,null,null,null,null,null,null,null,null,null,null,null,null,null,null,null,null,null,null,null,null,null,null,null,null,null,null,null,null,null,null,null,null,null,null,null,null,null,null,null,null,null,null,null,null,null,null,null,null,null,null,null,null,null,null,null,null,null,null,null,null,null,null,null,null,null,null,null,null,null,null,null,null,null,null,null,null,null,null,null,null,null,null,null,null,null,null,null,null,null,null,null,null,null,null,null,null,null,null,null,null,null,null,null,null,null,null,null,null,null,null,null,null,null,null,null,null,null,null,null,null,null,null,null,null,null,null,null,null,null,null,null,null,null,null,null,null,null,null,null,null,null,null,null,null,null,null,null,null,null,null,null,null,null,null,null,null,null,null,null,null,null,null,null,null,null,null,null,null,null,null,null,null,null,null,null,null,null,null,null,null,null,{"$f":"IF(SUMPRODUCT((OFFSET($A46,0,31*($A$9-1)+1,1,31)<>\"\")*(IF(OFFSET($A46,0,31*($A$9-1)+1,1,31)=$NL$9,0.5,1)*(OFFSET($A$9,0,31*($A$9-1)+1,1,31))))=0,\"\",SUMPRODUCT((OFFSET($A46,0,31*($A$9-1)+1,1,31)<>\"\")*(IF(OFFSET($A46,0,31*($A$9-1)+1,1,31)=$NL$9,0.5,1)*(OFFSET($A$9,0,31*($A$9-1)+1,1,31)))))","v":""},{"$f":"IF(SUMPRODUCT((OFFSET($A46,0,1,1,372)<>\"\")*(IF(OFFSET($A46,0,1,1,372)=$NL$9,0.5,1)*(OFFSET($A$9,0,1,1,372))))=0,\"\",SUMPRODUCT((OFFSET($A46,0,1,1,372)<>\"\")*(IF(OFFSET($A46,0,1,1,372)=$NL$9,0.5,1)*(OFFSET($A$9,0,1,1,372)))))","v":""},"",null,{"$f":"IF(SUMPRODUCT((OFFSET($A46,0,1,1,372)<>\"\")*(OFFSET($A$9,0,1,1,372))*((OFFSET($A46,0,1,1,372))=NL$5))=0,\"\",SUMPRODUCT((OFFSET($A46,0,1,1,372)<>\"\")*(OFFSET($A$9,0,1,1,372))*((OFFSET($A46,0,1,1,372))=NL$5)))","v":""},{"$f":"IF(SUMPRODUCT((OFFSET($A46,0,1,1,372)<>\"\")*(OFFSET($A$9,0,1,1,372))*((OFFSET($A46,0,1,1,372))=NL$6))=0,\"\",SUMPRODUCT((OFFSET($A46,0,1,1,372)<>\"\")*(OFFSET($A$9,0,1,1,372))*((OFFSET($A46,0,1,1,372))=NL$6)))","v":""},{"$f":"IF(SUMPRODUCT((OFFSET($A46,0,1,1,372)<>\"\")*(OFFSET($A$9,0,1,1,372))*((OFFSET($A46,0,1,1,372))=NL$7))=0,\"\",SUMPRODUCT((OFFSET($A46,0,1,1,372)<>\"\")*(OFFSET($A$9,0,1,1,372))*((OFFSET($A46,0,1,1,372))=NL$7)))","v":""},{"$f":"IF(SUMPRODUCT((OFFSET($A46,0,1,1,372)<>\"\")*(OFFSET($A$9,0,1,1,372))*((OFFSET($A46,0,1,1,372))=NL$8))=0,\"\",SUMPRODUCT((OFFSET($A46,0,1,1,372)<>\"\")*(OFFSET($A$9,0,1,1,372))*((OFFSET($A46,0,1,1,372))=NL$8)))","v":""},{"$f":"IF(SUMPRODUCT((OFFSET($A46,0,1,1,372)<>\"\")*(OFFSET($A$9,0,1,1,372))*((OFFSET($A46,0,1,1,372))=NL$9))=0,\"\",SUMPRODUCT((OFFSET($A46,0,1,1,372)<>\"\")*(OFFSET($A$9,0,1,1,372))*((OFFSET($A46,0,1,1,372))=NL$9)))","v":""}]
[null,null,null,null,null,null,null,null,null,null,null,null,null,null,null,null,null,null,null,null,null,null,null,null,null,null,null,null,null,null,null,null,null,null,null,null,null,null,null,null,null,null,null,null,null,null,null,null,null,null,null,null,null,null,null,null,null,null,null,null,null,null,null,null,null,null,null,null,null,null,null,null,null,null,null,null,null,null,null,null,null,null,null,null,null,null,null,null,null,null,null,null,null,null,null,null,null,null,null,null,null,null,null,null,null,null,null,null,null,null,null,null,null,null,null,null,null,null,null,null,null,null,null,null,null,null,null,null,null,null,null,null,null,null,null,null,null,null,null,null,null,null,null,null,null,null,null,null,null,null,null,null,null,null,null,null,null,null,null,null,null,null,null,null,null,null,null,null,null,null,null,null,null,null,null,null,null,null,null,null,null,null,null,null,null,null,null,null,null,null,null,null,null,null,null,null,null,null,null,null,null,null,null,null,null,null,null,null,null,null,null,null,null,null,null,null,null,null,null,null,null,null,null,null,null,null,null,null,null,null,null,null,null,null,null,null,null,null,null,null,null,null,null,null,null,null,null,null,null,null,null,null,null,null,null,null,null,null,null,null,null,null,null,null,null,null,null,null,null,null,null,null,null,null,null,null,null,null,null,null,null,null,null,null,null,null,null,null,null,null,null,null,null,null,null,null,null,null,null,null,null,null,null,null,null,null,null,null,null,null,null,null,null,null,null,null,null,null,null,null,null,null,null,null,null,null,null,null,null,null,null,null,null,null,null,null,null,null,null,null,null,null,null,null,null,null,null,null,null,null,null,null,null,null,null,null,null,null,null,null,null,null,null,null,null,null,null,null,null,null,null,null,null,null,null,null,null,{"$f":"IF(SUMPRODUCT((OFFSET($A47,0,31*($A$9-1)+1,1,31)<>\"\")*(IF(OFFSET($A47,0,31*($A$9-1)+1,1,31)=$NL$9,0.5,1)*(OFFSET($A$9,0,31*($A$9-1)+1,1,31))))=0,\"\",SUMPRODUCT((OFFSET($A47,0,31*($A$9-1)+1,1,31)<>\"\")*(IF(OFFSET($A47,0,31*($A$9-1)+1,1,31)=$NL$9,0.5,1)*(OFFSET($A$9,0,31*($A$9-1)+1,1,31)))))","v":""},{"$f":"IF(SUMPRODUCT((OFFSET($A47,0,1,1,372)<>\"\")*(IF(OFFSET($A47,0,1,1,372)=$NL$9,0.5,1)*(OFFSET($A$9,0,1,1,372))))=0,\"\",SUMPRODUCT((OFFSET($A47,0,1,1,372)<>\"\")*(IF(OFFSET($A47,0,1,1,372)=$NL$9,0.5,1)*(OFFSET($A$9,0,1,1,372)))))","v":""},"",null,{"$f":"IF(SUMPRODUCT((OFFSET($A47,0,1,1,372)<>\"\")*(OFFSET($A$9,0,1,1,372))*((OFFSET($A47,0,1,1,372))=NL$5))=0,\"\",SUMPRODUCT((OFFSET($A47,0,1,1,372)<>\"\")*(OFFSET($A$9,0,1,1,372))*((OFFSET($A47,0,1,1,372))=NL$5)))","v":""},{"$f":"IF(SUMPRODUCT((OFFSET($A47,0,1,1,372)<>\"\")*(OFFSET($A$9,0,1,1,372))*((OFFSET($A47,0,1,1,372))=NL$6))=0,\"\",SUMPRODUCT((OFFSET($A47,0,1,1,372)<>\"\")*(OFFSET($A$9,0,1,1,372))*((OFFSET($A47,0,1,1,372))=NL$6)))","v":""},{"$f":"IF(SUMPRODUCT((OFFSET($A47,0,1,1,372)<>\"\")*(OFFSET($A$9,0,1,1,372))*((OFFSET($A47,0,1,1,372))=NL$7))=0,\"\",SUMPRODUCT((OFFSET($A47,0,1,1,372)<>\"\")*(OFFSET($A$9,0,1,1,372))*((OFFSET($A47,0,1,1,372))=NL$7)))","v":""},{"$f":"IF(SUMPRODUCT((OFFSET($A47,0,1,1,372)<>\"\")*(OFFSET($A$9,0,1,1,372))*((OFFSET($A47,0,1,1,372))=NL$8))=0,\"\",SUMPRODUCT((OFFSET($A47,0,1,1,372)<>\"\")*(OFFSET($A$9,0,1,1,372))*((OFFSET($A47,0,1,1,372))=NL$8)))","v":""},{"$f":"IF(SUMPRODUCT((OFFSET($A47,0,1,1,372)<>\"\")*(OFFSET($A$9,0,1,1,372))*((OFFSET($A47,0,1,1,372))=NL$9))=0,\"\",SUMPRODUCT((OFFSET($A47,0,1,1,372)<>\"\")*(OFFSET($A$9,0,1,1,372))*((OFFSET($A47,0,1,1,372))=NL$9)))","v":""}]
[null,null,null,null,null,null,null,null,null,null,null,null,null,null,null,null,null,null,null,null,null,null,null,null,null,null,null,null,null,null,null,null,null,null,null,null,null,null,null,null,null,null,null,null,null,null,null,null,null,null,null,null,null,null,null,null,null,null,null,null,null,null,null,null,null,null,null,null,null,null,null,null,null,null,null,null,null,null,null,null,null,null,null,null,null,null,null,null,null,null,null,null,null,null,null,null,null,null,null,null,null,null,null,null,null,null,null,null,null,null,null,null,null,null,null,null,null,null,null,null,null,null,null,null,null,null,null,null,null,null,null,null,null,null,null,null,null,null,null,null,null,null,null,null,null,null,null,null,null,null,null,null,null,null,null,null,null,null,null,null,null,null,null,null,null,null,null,null,null,null,null,null,null,null,null,null,null,null,null,null,null,null,null,null,null,null,null,null,null,null,null,null,null,null,null,null,null,null,null,null,null,null,null,null,null,null,null,null,null,null,null,null,null,null,null,null,null,null,null,null,null,null,null,null,null,null,null,null,null,null,null,null,null,null,null,null,null,null,null,null,null,null,null,null,null,null,null,null,null,null,null,null,null,null,null,null,null,null,null,null,null,null,null,null,null,null,null,null,null,null,null,null,null,null,null,null,null,null,null,null,null,null,null,null,null,null,null,null,null,null,null,null,null,null,null,null,null,null,null,null,null,null,null,null,null,null,null,null,null,null,null,null,null,null,null,null,null,null,null,null,null,null,null,null,null,null,null,null,null,null,null,null,null,null,null,null,null,null,null,null,null,null,null,null,null,null,null,null,null,null,null,null,null,null,null,null,null,null,null,null,null,null,null,null,null,null,null,null,null,null,null,null,null,null,null,null,null,{"$f":"IF(SUMPRODUCT((OFFSET($A48,0,31*($A$9-1)+1,1,31)<>\"\")*(IF(OFFSET($A48,0,31*($A$9-1)+1,1,31)=$NL$9,0.5,1)*(OFFSET($A$9,0,31*($A$9-1)+1,1,31))))=0,\"\",SUMPRODUCT((OFFSET($A48,0,31*($A$9-1)+1,1,31)<>\"\")*(IF(OFFSET($A48,0,31*($A$9-1)+1,1,31)=$NL$9,0.5,1)*(OFFSET($A$9,0,31*($A$9-1)+1,1,31)))))","v":""},{"$f":"IF(SUMPRODUCT((OFFSET($A48,0,1,1,372)<>\"\")*(IF(OFFSET($A48,0,1,1,372)=$NL$9,0.5,1)*(OFFSET($A$9,0,1,1,372))))=0,\"\",SUMPRODUCT((OFFSET($A48,0,1,1,372)<>\"\")*(IF(OFFSET($A48,0,1,1,372)=$NL$9,0.5,1)*(OFFSET($A$9,0,1,1,372)))))","v":""},"",null,{"$f":"IF(SUMPRODUCT((OFFSET($A48,0,1,1,372)<>\"\")*(OFFSET($A$9,0,1,1,372))*((OFFSET($A48,0,1,1,372))=NL$5))=0,\"\",SUMPRODUCT((OFFSET($A48,0,1,1,372)<>\"\")*(OFFSET($A$9,0,1,1,372))*((OFFSET($A48,0,1,1,372))=NL$5)))","v":""},{"$f":"IF(SUMPRODUCT((OFFSET($A48,0,1,1,372)<>\"\")*(OFFSET($A$9,0,1,1,372))*((OFFSET($A48,0,1,1,372))=NL$6))=0,\"\",SUMPRODUCT((OFFSET($A48,0,1,1,372)<>\"\")*(OFFSET($A$9,0,1,1,372))*((OFFSET($A48,0,1,1,372))=NL$6)))","v":""},{"$f":"IF(SUMPRODUCT((OFFSET($A48,0,1,1,372)<>\"\")*(OFFSET($A$9,0,1,1,372))*((OFFSET($A48,0,1,1,372))=NL$7))=0,\"\",SUMPRODUCT((OFFSET($A48,0,1,1,372)<>\"\")*(OFFSET($A$9,0,1,1,372))*((OFFSET($A48,0,1,1,372))=NL$7)))","v":""},{"$f":"IF(SUMPRODUCT((OFFSET($A48,0,1,1,372)<>\"\")*(OFFSET($A$9,0,1,1,372))*((OFFSET($A48,0,1,1,372))=NL$8))=0,\"\",SUMPRODUCT((OFFSET($A48,0,1,1,372)<>\"\")*(OFFSET($A$9,0,1,1,372))*((OFFSET($A48,0,1,1,372))=NL$8)))","v":""},{"$f":"IF(SUMPRODUCT((OFFSET($A48,0,1,1,372)<>\"\")*(OFFSET($A$9,0,1,1,372))*((OFFSET($A48,0,1,1,372))=NL$9))=0,\"\",SUMPRODUCT((OFFSET($A48,0,1,1,372)<>\"\")*(OFFSET($A$9,0,1,1,372))*((OFFSET($A48,0,1,1,372))=NL$9)))","v":""}]
[null,null,null,null,null,null,null,null,null,null,null,null,null,null,null,null,null,null,null,null,null,null,null,null,null,null,null,null,null,null,null,null,null,null,null,null,null,null,null,null,null,null,null,null,null,null,null,null,null,null,null,null,null,null,null,null,null,null,null,null,null,null,null,null,null,null,null,null,null,null,null,null,null,null,null,null,null,null,null,null,null,null,null,null,null,null,null,null,null,null,null,null,null,null,null,null,null,null,null,null,null,null,null,null,null,null,null,null,null,null,null,null,null,null,null,null,null,null,null,null,null,null,null,null,null,null,null,null,null,null,null,null,null,null,null,null,null,null,null,null,null,null,null,null,null,null,null,null,null,null,null,null,null,null,null,null,null,null,null,null,null,null,null,null,null,null,null,null,null,null,null,null,null,null,null,null,null,null,null,null,null,null,null,null,null,null,null,null,null,null,null,null,null,null,null,null,null,null,null,null,null,null,null,null,null,null,null,null,null,null,null,null,null,null,null,null,null,null,null,null,null,null,null,null,null,null,null,null,null,null,null,null,null,null,null,null,null,null,null,null,null,null,null,null,null,null,null,null,null,null,null,null,null,null,null,null,null,null,null,null,null,null,null,null,null,null,null,null,null,null,null,null,null,null,null,null,null,null,null,null,null,null,null,null,null,null,null,null,null,null,null,null,null,null,null,null,null,null,null,null,null,null,null,null,null,null,null,null,null,null,null,null,null,null,null,null,null,null,null,null,null,null,null,null,null,null,null,null,null,null,null,null,null,null,null,null,null,null,null,null,null,null,null,null,null,null,null,null,null,null,null,null,null,null,null,null,null,null,null,null,null,null,null,null,null,null,null,null,null,null,null,null,null,null,null,null,null,{"$f":"IF(SUMPRODUCT((OFFSET($A49,0,31*($A$9-1)+1,1,31)<>\"\")*(IF(OFFSET($A49,0,31*($A$9-1)+1,1,31)=$NL$9,0.5,1)*(OFFSET($A$9,0,31*($A$9-1)+1,1,31))))=0,\"\",SUMPRODUCT((OFFSET($A49,0,31*($A$9-1)+1,1,31)<>\"\")*(IF(OFFSET($A49,0,31*($A$9-1)+1,1,31)=$NL$9,0.5,1)*(OFFSET($A$9,0,31*($A$9-1)+1,1,31)))))","v":""},{"$f":"IF(SUMPRODUCT((OFFSET($A49,0,1,1,372)<>\"\")*(IF(OFFSET($A49,0,1,1,372)=$NL$9,0.5,1)*(OFFSET($A$9,0,1,1,372))))=0,\"\",SUMPRODUCT((OFFSET($A49,0,1,1,372)<>\"\")*(IF(OFFSET($A49,0,1,1,372)=$NL$9,0.5,1)*(OFFSET($A$9,0,1,1,372)))))","v":""},"",null,{"$f":"IF(SUMPRODUCT((OFFSET($A49,0,1,1,372)<>\"\")*(OFFSET($A$9,0,1,1,372))*((OFFSET($A49,0,1,1,372))=NL$5))=0,\"\",SUMPRODUCT((OFFSET($A49,0,1,1,372)<>\"\")*(OFFSET($A$9,0,1,1,372))*((OFFSET($A49,0,1,1,372))=NL$5)))","v":""},{"$f":"IF(SUMPRODUCT((OFFSET($A49,0,1,1,372)<>\"\")*(OFFSET($A$9,0,1,1,372))*((OFFSET($A49,0,1,1,372))=NL$6))=0,\"\",SUMPRODUCT((OFFSET($A49,0,1,1,372)<>\"\")*(OFFSET($A$9,0,1,1,372))*((OFFSET($A49,0,1,1,372))=NL$6)))","v":""},{"$f":"IF(SUMPRODUCT((OFFSET($A49,0,1,1,372)<>\"\")*(OFFSET($A$9,0,1,1,372))*((OFFSET($A49,0,1,1,372))=NL$7))=0,\"\",SUMPRODUCT((OFFSET($A49,0,1,1,372)<>\"\")*(OFFSET($A$9,0,1,1,372))*((OFFSET($A49,0,1,1,372))=NL$7)))","v":""},{"$f":"IF(SUMPRODUCT((OFFSET($A49,0,1,1,372)<>\"\")*(OFFSET($A$9,0,1,1,372))*((OFFSET($A49,0,1,1,372))=NL$8))=0,\"\",SUMPRODUCT((OFFSET($A49,0,1,1,372)<>\"\")*(OFFSET($A$9,0,1,1,372))*((OFFSET($A49,0,1,1,372))=NL$8)))","v":""},{"$f":"IF(SUMPRODUCT((OFFSET($A49,0,1,1,372)<>\"\")*(OFFSET($A$9,0,1,1,372))*((OFFSET($A49,0,1,1,372))=NL$9))=0,\"\",SUMPRODUCT((OFFSET($A49,0,1,1,372)<>\"\")*(OFFSET($A$9,0,1,1,372))*((OFFSET($A49,0,1,1,372))=NL$9)))","v":""}]
[null,null,null,null,null,null,null,null,null,null,null,null,null,null,null,null,null,null,null,null,null,null,null,null,null,null,null,null,null,null,null,null,null,null,null,null,null,null,null,null,null,null,null,null,null,null,null,null,null,null,null,null,null,null,null,null,null,null,null,null,null,null,null,null,null,null,null,null,null,null,null,null,null,null,null,null,null,null,null,null,null,null,null,null,null,null,null,null,null,null,null,null,null,null,null,null,null,null,null,null,null,null,null,null,null,null,null,null,null,null,null,null,null,null,null,null,null,null,null,null,null,null,null,null,null,null,null,null,null,null,null,null,null,null,null,null,null,null,null,null,null,null,null,null,null,null,null,null,null,null,null,null,null,null,null,null,null,null,null,null,null,null,null,null,null,null,null,null,null,null,null,null,null,null,null,null,null,null,null,null,null,null,null,null,null,null,null,null,null,null,null,null,null,null,null,null,null,null,null,null,null,null,null,null,null,null,null,null,null,null,null,null,null,null,null,null,null,null,null,null,null,null,null,null,null,null,null,null,null,null,null,null,null,null,null,null,null,null,null,null,null,null,null,null,null,null,null,null,null,null,null,null,null,null,null,null,null,null,null,null,null,null,null,null,null,null,null,null,null,null,null,null,null,null,null,null,null,null,null,null,null,null,null,null,null,null,null,null,null,null,null,null,null,null,null,null,null,null,null,null,null,null,null,null,null,null,null,null,null,null,null,null,null,null,null,null,null,null,null,null,null,null,null,null,null,null,null,null,null,null,null,null,null,null,null,null,null,null,null,null,null,null,null,null,null,null,null,null,null,null,null,null,null,null,null,null,null,null,null,null,null,null,null,null,null,null,null,null,null,null,null,null,null,null,null,null,null,{"$f":"IF(SUMPRODUCT((OFFSET($A50,0,31*($A$9-1)+1,1,31)<>\"\")*(IF(OFFSET($A50,0,31*($A$9-1)+1,1,31)=$NL$9,0.5,1)*(OFFSET($A$9,0,31*($A$9-1)+1,1,31))))=0,\"\",SUMPRODUCT((OFFSET($A50,0,31*($A$9-1)+1,1,31)<>\"\")*(IF(OFFSET($A50,0,31*($A$9-1)+1,1,31)=$NL$9,0.5,1)*(OFFSET($A$9,0,31*($A$9-1)+1,1,31)))))","v":""},{"$f":"IF(SUMPRODUCT((OFFSET($A50,0,1,1,372)<>\"\")*(IF(OFFSET($A50,0,1,1,372)=$NL$9,0.5,1)*(OFFSET($A$9,0,1,1,372))))=0,\"\",SUMPRODUCT((OFFSET($A50,0,1,1,372)<>\"\")*(IF(OFFSET($A50,0,1,1,372)=$NL$9,0.5,1)*(OFFSET($A$9,0,1,1,372)))))","v":""},"",null,{"$f":"IF(SUMPRODUCT((OFFSET($A50,0,1,1,372)<>\"\")*(OFFSET($A$9,0,1,1,372))*((OFFSET($A50,0,1,1,372))=NL$5))=0,\"\",SUMPRODUCT((OFFSET($A50,0,1,1,372)<>\"\")*(OFFSET($A$9,0,1,1,372))*((OFFSET($A50,0,1,1,372))=NL$5)))","v":""},{"$f":"IF(SUMPRODUCT((OFFSET($A50,0,1,1,372)<>\"\")*(OFFSET($A$9,0,1,1,372))*((OFFSET($A50,0,1,1,372))=NL$6))=0,\"\",SUMPRODUCT((OFFSET($A50,0,1,1,372)<>\"\")*(OFFSET($A$9,0,1,1,372))*((OFFSET($A50,0,1,1,372))=NL$6)))","v":""},{"$f":"IF(SUMPRODUCT((OFFSET($A50,0,1,1,372)<>\"\")*(OFFSET($A$9,0,1,1,372))*((OFFSET($A50,0,1,1,372))=NL$7))=0,\"\",SUMPRODUCT((OFFSET($A50,0,1,1,372)<>\"\")*(OFFSET($A$9,0,1,1,372))*((OFFSET($A50,0,1,1,372))=NL$7)))","v":""},{"$f":"IF(SUMPRODUCT((OFFSET($A50,0,1,1,372)<>\"\")*(OFFSET($A$9,0,1,1,372))*((OFFSET($A50,0,1,1,372))=NL$8))=0,\"\",SUMPRODUCT((OFFSET($A50,0,1,1,372)<>\"\")*(OFFSET($A$9,0,1,1,372))*((OFFSET($A50,0,1,1,372))=NL$8)))","v":""},{"$f":"IF(SUMPRODUCT((OFFSET($A50,0,1,1,372)<>\"\")*(OFFSET($A$9,0,1,1,372))*((OFFSET($A50,0,1,1,372))=NL$9))=0,\"\",SUMPRODUCT((OFFSET($A50,0,1,1,372)<>\"\")*(OFFSET($A$9,0,1,1,372))*((OFFSET($A50,0,1,1,372))=NL$9)))","v":""}]
[null,null,null,null,null,null,null,null,null,null,null,null,null,null,null,null,null,null,null,null,null,null,null,null,null,null,null,null,null,null,null,null,null,null,null,null,null,null,null,null,null,null,null,null,null,null,null,null,null,null,null,null,null,null,null,null,null,null,null,null,null,null,null,null,null,null,null,null,null,null,null,null,null,null,null,null,null,null,null,null,null,null,null,null,null,null,null,null,null,null,null,null,null,null,null,null,null,null,null,null,null,null,null,null,null,null,null,null,null,null,null,null,null,null,null,null,null,null,null,null,null,null,null,null,null,null,null,null,null,null,null,null,null,null,null,null,null,null,null,null,null,null,null,null,null,null,null,null,null,null,null,null,null,null,null,null,null,null,null,null,null,null,null,null,null,null,null,null,null,null,null,null,null,null,null,null,null,null,null,null,null,null,null,null,null,null,null,null,null,null,null,null,null,null,null,null,null,null,null,null,null,null,null,null,null,null,null,null,null,null,null,null,null,null,null,null,null,null,null,null,null,null,null,null,null,null,null,null,null,null,null,null,null,null,null,null,null,null,null,null,null,null,null,null,null,null,null,null,null,null,null,null,null,null,null,null,null,null,null,null,null,null,null,null,null,null,null,null,null,null,null,null,null,null,null,null,null,null,null,null,null,null,null,null,null,null,null,null,null,null,null,null,null,null,null,null,null,null,null,null,null,null,null,null,null,null,null,null,null,null,null,null,null,null,null,null,null,null,null,null,null,null,null,null,null,null,null,null,null,null,null,null,null,null,null,null,null,null,null,null,null,null,null,null,null,null,null,null,null,null,null,null,null,null,null,null,null,null,null,null,null,null,null,null,null,null,null,null,null,null,null,null,null,null,null,null,null,{"$f":"IF(SUMPRODUCT((OFFSET($A51,0,31*($A$9-1)+1,1,31)<>\"\")*(IF(OFFSET($A51,0,31*($A$9-1)+1,1,31)=$NL$9,0.5,1)*(OFFSET($A$9,0,31*($A$9-1)+1,1,31))))=0,\"\",SUMPRODUCT((OFFSET($A51,0,31*($A$9-1)+1,1,31)<>\"\")*(IF(OFFSET($A51,0,31*($A$9-1)+1,1,31)=$NL$9,0.5,1)*(OFFSET($A$9,0,31*($A$9-1)+1,1,31)))))","v":""},{"$f":"IF(SUMPRODUCT((OFFSET($A51,0,1,1,372)<>\"\")*(IF(OFFSET($A51,0,1,1,372)=$NL$9,0.5,1)*(OFFSET($A$9,0,1,1,372))))=0,\"\",SUMPRODUCT((OFFSET($A51,0,1,1,372)<>\"\")*(IF(OFFSET($A51,0,1,1,372)=$NL$9,0.5,1)*(OFFSET($A$9,0,1,1,372)))))","v":""},"",null,{"$f":"IF(SUMPRODUCT((OFFSET($A51,0,1,1,372)<>\"\")*(OFFSET($A$9,0,1,1,372))*((OFFSET($A51,0,1,1,372))=NL$5))=0,\"\",SUMPRODUCT((OFFSET($A51,0,1,1,372)<>\"\")*(OFFSET($A$9,0,1,1,372))*((OFFSET($A51,0,1,1,372))=NL$5)))","v":""},{"$f":"IF(SUMPRODUCT((OFFSET($A51,0,1,1,372)<>\"\")*(OFFSET($A$9,0,1,1,372))*((OFFSET($A51,0,1,1,372))=NL$6))=0,\"\",SUMPRODUCT((OFFSET($A51,0,1,1,372)<>\"\")*(OFFSET($A$9,0,1,1,372))*((OFFSET($A51,0,1,1,372))=NL$6)))","v":""},{"$f":"IF(SUMPRODUCT((OFFSET($A51,0,1,1,372)<>\"\")*(OFFSET($A$9,0,1,1,372))*((OFFSET($A51,0,1,1,372))=NL$7))=0,\"\",SUMPRODUCT((OFFSET($A51,0,1,1,372)<>\"\")*(OFFSET($A$9,0,1,1,372))*((OFFSET($A51,0,1,1,372))=NL$7)))","v":""},{"$f":"IF(SUMPRODUCT((OFFSET($A51,0,1,1,372)<>\"\")*(OFFSET($A$9,0,1,1,372))*((OFFSET($A51,0,1,1,372))=NL$8))=0,\"\",SUMPRODUCT((OFFSET($A51,0,1,1,372)<>\"\")*(OFFSET($A$9,0,1,1,372))*((OFFSET($A51,0,1,1,372))=NL$8)))","v":""},{"$f":"IF(SUMPRODUCT((OFFSET($A51,0,1,1,372)<>\"\")*(OFFSET($A$9,0,1,1,372))*((OFFSET($A51,0,1,1,372))=NL$9))=0,\"\",SUMPRODUCT((OFFSET($A51,0,1,1,372)<>\"\")*(OFFSET($A$9,0,1,1,372))*((OFFSET($A51,0,1,1,372))=NL$9)))","v":""}]
[null,null,null,null,null,null,null,null,null,null,null,null,null,null,null,null,null,null,null,null,null,null,null,null,null,null,null,null,null,null,null,null,null,null,null,null,null,null,null,null,null,null,null,null,null,null,null,null,null,null,null,null,null,null,null,null,null,null,null,null,null,null,null,null,null,null,null,null,null,null,null,null,null,null,null,null,null,null,null,null,null,null,null,null,null,null,null,null,null,null,null,null,null,null,null,null,null,null,null,null,null,null,null,null,null,null,null,null,null,null,null,null,null,null,null,null,null,null,null,null,null,null,null,null,null,null,null,null,null,null,null,null,null,null,null,null,null,null,null,null,null,null,null,null,null,null,null,null,null,null,null,null,null,null,null,null,null,null,null,null,null,null,null,null,null,null,null,null,null,null,null,null,null,null,null,null,null,null,null,null,null,null,null,null,null,null,null,null,null,null,null,null,null,null,null,null,null,null,null,null,null,null,null,null,null,null,null,null,null,null,null,null,null,null,null,null,null,null,null,null,null,null,null,null,null,null,null,null,null,null,null,null,null,null,null,null,null,null,null,null,null,null,null,null,null,null,null,null,null,null,null,null,null,null,null,null,null,null,null,null,null,null,null,null,null,null,null,null,null,null,null,null,null,null,null,null,null,null,null,null,null,null,null,null,null,null,null,null,null,null,null,null,null,null,null,null,null,null,null,null,null,null,null,null,null,null,null,null,null,null,null,null,null,null,null,null,null,null,null,null,null,null,null,null,null,null,null,null,null,null,null,null,null,null,null,null,null,null,null,null,null,null,null,null,null,null,null,null,null,null,null,null,null,null,null,null,null,null,null,null,null,null,null,null,null,null,null,null,null,null,null,null,null,null,null,null,null,{"$f":"IF(SUMPRODUCT((OFFSET($A52,0,31*($A$9-1)+1,1,31)<>\"\")*(IF(OFFSET($A52,0,31*($A$9-1)+1,1,31)=$NL$9,0.5,1)*(OFFSET($A$9,0,31*($A$9-1)+1,1,31))))=0,\"\",SUMPRODUCT((OFFSET($A52,0,31*($A$9-1)+1,1,31)<>\"\")*(IF(OFFSET($A52,0,31*($A$9-1)+1,1,31)=$NL$9,0.5,1)*(OFFSET($A$9,0,31*($A$9-1)+1,1,31)))))","v":""},{"$f":"IF(SUMPRODUCT((OFFSET($A52,0,1,1,372)<>\"\")*(IF(OFFSET($A52,0,1,1,372)=$NL$9,0.5,1)*(OFFSET($A$9,0,1,1,372))))=0,\"\",SUMPRODUCT((OFFSET($A52,0,1,1,372)<>\"\")*(IF(OFFSET($A52,0,1,1,372)=$NL$9,0.5,1)*(OFFSET($A$9,0,1,1,372)))))","v":""},"",null,{"$f":"IF(SUMPRODUCT((OFFSET($A52,0,1,1,372)<>\"\")*(OFFSET($A$9,0,1,1,372))*((OFFSET($A52,0,1,1,372))=NL$5))=0,\"\",SUMPRODUCT((OFFSET($A52,0,1,1,372)<>\"\")*(OFFSET($A$9,0,1,1,372))*((OFFSET($A52,0,1,1,372))=NL$5)))","v":""},{"$f":"IF(SUMPRODUCT((OFFSET($A52,0,1,1,372)<>\"\")*(OFFSET($A$9,0,1,1,372))*((OFFSET($A52,0,1,1,372))=NL$6))=0,\"\",SUMPRODUCT((OFFSET($A52,0,1,1,372)<>\"\")*(OFFSET($A$9,0,1,1,372))*((OFFSET($A52,0,1,1,372))=NL$6)))","v":""},{"$f":"IF(SUMPRODUCT((OFFSET($A52,0,1,1,372)<>\"\")*(OFFSET($A$9,0,1,1,372))*((OFFSET($A52,0,1,1,372))=NL$7))=0,\"\",SUMPRODUCT((OFFSET($A52,0,1,1,372)<>\"\")*(OFFSET($A$9,0,1,1,372))*((OFFSET($A52,0,1,1,372))=NL$7)))","v":""},{"$f":"IF(SUMPRODUCT((OFFSET($A52,0,1,1,372)<>\"\")*(OFFSET($A$9,0,1,1,372))*((OFFSET($A52,0,1,1,372))=NL$8))=0,\"\",SUMPRODUCT((OFFSET($A52,0,1,1,372)<>\"\")*(OFFSET($A$9,0,1,1,372))*((OFFSET($A52,0,1,1,372))=NL$8)))","v":""},{"$f":"IF(SUMPRODUCT((OFFSET($A52,0,1,1,372)<>\"\")*(OFFSET($A$9,0,1,1,372))*((OFFSET($A52,0,1,1,372))=NL$9))=0,\"\",SUMPRODUCT((OFFSET($A52,0,1,1,372)<>\"\")*(OFFSET($A$9,0,1,1,372))*((OFFSET($A52,0,1,1,372))=NL$9)))","v":""}]
[null,null,null,null,null,null,null,null,null,null,null,null,null,null,null,null,null,null,null,null,null,null,null,null,null,null,null,null,null,null,null,null,null,null,null,null,null,null,null,null,null,null,null,null,null,null,null,null,null,null,null,null,null,null,null,null,null,null,null,null,null,null,null,null,null,null,null,null,null,null,null,null,null,null,null,null,null,null,null,null,null,null,null,null,null,null,null,null,null,null,null,null,null,null,null,null,null,null,null,null,null,null,null,null,null,null,null,null,null,null,null,null,null,null,null,null,null,null,null,null,null,null,null,null,null,null,null,null,null,null,null,null,null,null,null,null,null,null,null,null,null,null,null,null,null,null,null,null,null,null,null,null,null,null,null,null,null,null,null,null,null,null,null,null,null,null,null,null,null,null,null,null,null,null,null,null,null,null,null,null,null,null,null,null,null,null,null,null,null,null,null,null,null,null,null,null,null,null,null,null,null,null,null,null,null,null,null,null,null,null,null,null,null,null,null,null,null,null,null,null,null,null,null,null,null,null,null,null,null,null,null,null,null,null,null,null,null,null,null,null,null,null,null,null,null,null,null,null,null,null,null,null,null,null,null,null,null,null,null,null,null,null,null,null,null,null,null,null,null,null,null,null,null,null,null,null,null,null,null,null,null,null,null,null,null,null,null,null,null,null,null,null,null,null,null,null,null,null,null,null,null,null,null,null,null,null,null,null,null,null,null,null,null,null,null,null,null,null,null,null,null,null,null,null,null,null,null,null,null,null,null,null,null,null,null,null,null,null,null,null,null,null,null,null,null,null,null,null,null,null,null,null,null,null,null,null,null,null,null,null,null,null,null,null,null,null,null,null,null,null,null,null,null,null,null,null,null,{"$f":"IF(SUMPRODUCT((OFFSET($A53,0,31*($A$9-1)+1,1,31)<>\"\")*(IF(OFFSET($A53,0,31*($A$9-1)+1,1,31)=$NL$9,0.5,1)*(OFFSET($A$9,0,31*($A$9-1)+1,1,31))))=0,\"\",SUMPRODUCT((OFFSET($A53,0,31*($A$9-1)+1,1,31)<>\"\")*(IF(OFFSET($A53,0,31*($A$9-1)+1,1,31)=$NL$9,0.5,1)*(OFFSET($A$9,0,31*($A$9-1)+1,1,31)))))","v":""},{"$f":"IF(SUMPRODUCT((OFFSET($A53,0,1,1,372)<>\"\")*(IF(OFFSET($A53,0,1,1,372)=$NL$9,0.5,1)*(OFFSET($A$9,0,1,1,372))))=0,\"\",SUMPRODUCT((OFFSET($A53,0,1,1,372)<>\"\")*(IF(OFFSET($A53,0,1,1,372)=$NL$9,0.5,1)*(OFFSET($A$9,0,1,1,372)))))","v":""},"",null,{"$f":"IF(SUMPRODUCT((OFFSET($A53,0,1,1,372)<>\"\")*(OFFSET($A$9,0,1,1,372))*((OFFSET($A53,0,1,1,372))=NL$5))=0,\"\",SUMPRODUCT((OFFSET($A53,0,1,1,372)<>\"\")*(OFFSET($A$9,0,1,1,372))*((OFFSET($A53,0,1,1,372))=NL$5)))","v":""},{"$f":"IF(SUMPRODUCT((OFFSET($A53,0,1,1,372)<>\"\")*(OFFSET($A$9,0,1,1,372))*((OFFSET($A53,0,1,1,372))=NL$6))=0,\"\",SUMPRODUCT((OFFSET($A53,0,1,1,372)<>\"\")*(OFFSET($A$9,0,1,1,372))*((OFFSET($A53,0,1,1,372))=NL$6)))","v":""},{"$f":"IF(SUMPRODUCT((OFFSET($A53,0,1,1,372)<>\"\")*(OFFSET($A$9,0,1,1,372))*((OFFSET($A53,0,1,1,372))=NL$7))=0,\"\",SUMPRODUCT((OFFSET($A53,0,1,1,372)<>\"\")*(OFFSET($A$9,0,1,1,372))*((OFFSET($A53,0,1,1,372))=NL$7)))","v":""},{"$f":"IF(SUMPRODUCT((OFFSET($A53,0,1,1,372)<>\"\")*(OFFSET($A$9,0,1,1,372))*((OFFSET($A53,0,1,1,372))=NL$8))=0,\"\",SUMPRODUCT((OFFSET($A53,0,1,1,372)<>\"\")*(OFFSET($A$9,0,1,1,372))*((OFFSET($A53,0,1,1,372))=NL$8)))","v":""},{"$f":"IF(SUMPRODUCT((OFFSET($A53,0,1,1,372)<>\"\")*(OFFSET($A$9,0,1,1,372))*((OFFSET($A53,0,1,1,372))=NL$9))=0,\"\",SUMPRODUCT((OFFSET($A53,0,1,1,372)<>\"\")*(OFFSET($A$9,0,1,1,372))*((OFFSET($A53,0,1,1,372))=NL$9)))","v":""}]
[null,null,null,null,null,null,null,null,null,null,null,null,null,null,null,null,null,null,null,null,null,null,null,null,null,null,null,null,null,null,null,null,null,null,null,null,null,null,null,null,null,null,null,null,null,null,null,null,null,null,null,null,null,null,null,null,null,null,null,null,null,null,null,null,null,null,null,null,null,null,null,null,null,null,null,null,null,null,null,null,null,null,null,null,null,null,null,null,null,null,null,null,null,null,null,null,null,null,null,null,null,null,null,null,null,null,null,null,null,null,null,null,null,null,null,null,null,null,null,null,null,null,null,null,null,null,null,null,null,null,null,null,null,null,null,null,null,null,null,null,null,null,null,null,null,null,null,null,null,null,null,null,null,null,null,null,null,null,null,null,null,null,null,null,null,null,null,null,null,null,null,null,null,null,null,null,null,null,null,null,null,null,null,null,null,null,null,null,null,null,null,null,null,null,null,null,null,null,null,null,null,null,null,null,null,null,null,null,null,null,null,null,null,null,null,null,null,null,null,null,null,null,null,null,null,null,null,null,null,null,null,null,null,null,null,null,null,null,null,null,null,null,null,null,null,null,null,null,null,null,null,null,null,null,null,null,null,null,null,null,null,null,null,null,null,null,null,null,null,null,null,null,null,null,null,null,null,null,null,null,null,null,null,null,null,null,null,null,null,null,null,null,null,null,null,null,null,null,null,null,null,null,null,null,null,null,null,null,null,null,null,null,null,null,null,null,null,null,null,null,null,null,null,null,null,null,null,null,null,null,null,null,null,null,null,null,null,null,null,null,null,null,null,null,null,null,null,null,null,null,null,null,null,null,null,null,null,null,null,null,null,null,null,null,null,null,null,null,null,null,null,null,null,null,null,null,null,{"$f":"IF(SUMPRODUCT((OFFSET($A54,0,31*($A$9-1)+1,1,31)<>\"\")*(IF(OFFSET($A54,0,31*($A$9-1)+1,1,31)=$NL$9,0.5,1)*(OFFSET($A$9,0,31*($A$9-1)+1,1,31))))=0,\"\",SUMPRODUCT((OFFSET($A54,0,31*($A$9-1)+1,1,31)<>\"\")*(IF(OFFSET($A54,0,31*($A$9-1)+1,1,31)=$NL$9,0.5,1)*(OFFSET($A$9,0,31*($A$9-1)+1,1,31)))))","v":""},{"$f":"IF(SUMPRODUCT((OFFSET($A54,0,1,1,372)<>\"\")*(IF(OFFSET($A54,0,1,1,372)=$NL$9,0.5,1)*(OFFSET($A$9,0,1,1,372))))=0,\"\",SUMPRODUCT((OFFSET($A54,0,1,1,372)<>\"\")*(IF(OFFSET($A54,0,1,1,372)=$NL$9,0.5,1)*(OFFSET($A$9,0,1,1,372)))))","v":""},"",null,{"$f":"IF(SUMPRODUCT((OFFSET($A54,0,1,1,372)<>\"\")*(OFFSET($A$9,0,1,1,372))*((OFFSET($A54,0,1,1,372))=NL$5))=0,\"\",SUMPRODUCT((OFFSET($A54,0,1,1,372)<>\"\")*(OFFSET($A$9,0,1,1,372))*((OFFSET($A54,0,1,1,372))=NL$5)))","v":""},{"$f":"IF(SUMPRODUCT((OFFSET($A54,0,1,1,372)<>\"\")*(OFFSET($A$9,0,1,1,372))*((OFFSET($A54,0,1,1,372))=NL$6))=0,\"\",SUMPRODUCT((OFFSET($A54,0,1,1,372)<>\"\")*(OFFSET($A$9,0,1,1,372))*((OFFSET($A54,0,1,1,372))=NL$6)))","v":""},{"$f":"IF(SUMPRODUCT((OFFSET($A54,0,1,1,372)<>\"\")*(OFFSET($A$9,0,1,1,372))*((OFFSET($A54,0,1,1,372))=NL$7))=0,\"\",SUMPRODUCT((OFFSET($A54,0,1,1,372)<>\"\")*(OFFSET($A$9,0,1,1,372))*((OFFSET($A54,0,1,1,372))=NL$7)))","v":""},{"$f":"IF(SUMPRODUCT((OFFSET($A54,0,1,1,372)<>\"\")*(OFFSET($A$9,0,1,1,372))*((OFFSET($A54,0,1,1,372))=NL$8))=0,\"\",SUMPRODUCT((OFFSET($A54,0,1,1,372)<>\"\")*(OFFSET($A$9,0,1,1,372))*((OFFSET($A54,0,1,1,372))=NL$8)))","v":""},{"$f":"IF(SUMPRODUCT((OFFSET($A54,0,1,1,372)<>\"\")*(OFFSET($A$9,0,1,1,372))*((OFFSET($A54,0,1,1,372))=NL$9))=0,\"\",SUMPRODUCT((OFFSET($A54,0,1,1,372)<>\"\")*(OFFSET($A$9,0,1,1,372))*((OFFSET($A54,0,1,1,372))=NL$9)))","v":""}]
[null,null,null,null,null,null,null,null,null,null,null,null,null,null,null,null,null,null,null,null,null,null,null,null,null,null,null,null,null,null,null,null,null,null,null,null,null,null,null,null,null,null,null,null,null,null,null,null,null,null,null,null,null,null,null,null,null,null,null,null,null,null,null,null,null,null,null,null,null,null,null,null,null,null,null,null,null,null,null,null,null,null,null,null,null,null,null,null,null,null,null,null,null,null,null,null,null,null,null,null,null,null,null,null,null,null,null,null,null,null,null,null,null,null,null,null,null,null,null,null,null,null,null,null,null,null,null,null,null,null,null,null,null,null,null,null,null,null,null,null,null,null,null,null,null,null,null,null,null,null,null,null,null,null,null,null,null,null,null,null,null,null,null,null,null,null,null,null,null,null,null,null,null,null,null,null,null,null,null,null,null,null,null,null,null,null,null,null,null,null,null,null,null,null,null,null,null,null,null,null,null,null,null,null,null,null,null,null,null,null,null,null,null,null,null,null,null,null,null,null,null,null,null,null,null,null,null,null,null,null,null,null,null,null,null,null,null,null,null,null,null,null,null,null,null,null,null,null,null,null,null,null,null,null,null,null,null,null,null,null,null,null,null,null,null,null,null,null,null,null,null,null,null,null,null,null,null,null,null,null,null,null,null,null,null,null,null,null,null,null,null,null,null,null,null,null,null,null,null,null,null,null,null,null,null,null,null,null,null,null,null,null,null,null,null,null,null,null,null,null,null,null,null,null,null,null,null,null,null,null,null,null,null,null,null,null,null,null,null,null,null,null,null,null,null,null,null,null,null,null,null,null,null,null,null,null,null,null,null,null,null,null,null,null,null,null,null,null,null,null,null,null,null,null,null,null,null,{"$f":"IF(SUMPRODUCT((OFFSET($A55,0,31*($A$9-1)+1,1,31)<>\"\")*(IF(OFFSET($A55,0,31*($A$9-1)+1,1,31)=$NL$9,0.5,1)*(OFFSET($A$9,0,31*($A$9-1)+1,1,31))))=0,\"\",SUMPRODUCT((OFFSET($A55,0,31*($A$9-1)+1,1,31)<>\"\")*(IF(OFFSET($A55,0,31*($A$9-1)+1,1,31)=$NL$9,0.5,1)*(OFFSET($A$9,0,31*($A$9-1)+1,1,31)))))","v":""},{"$f":"IF(SUMPRODUCT((OFFSET($A55,0,1,1,372)<>\"\")*(IF(OFFSET($A55,0,1,1,372)=$NL$9,0.5,1)*(OFFSET($A$9,0,1,1,372))))=0,\"\",SUMPRODUCT((OFFSET($A55,0,1,1,372)<>\"\")*(IF(OFFSET($A55,0,1,1,372)=$NL$9,0.5,1)*(OFFSET($A$9,0,1,1,372)))))","v":""},"",null,{"$f":"IF(SUMPRODUCT((OFFSET($A55,0,1,1,372)<>\"\")*(OFFSET($A$9,0,1,1,372))*((OFFSET($A55,0,1,1,372))=NL$5))=0,\"\",SUMPRODUCT((OFFSET($A55,0,1,1,372)<>\"\")*(OFFSET($A$9,0,1,1,372))*((OFFSET($A55,0,1,1,372))=NL$5)))","v":""},{"$f":"IF(SUMPRODUCT((OFFSET($A55,0,1,1,372)<>\"\")*(OFFSET($A$9,0,1,1,372))*((OFFSET($A55,0,1,1,372))=NL$6))=0,\"\",SUMPRODUCT((OFFSET($A55,0,1,1,372)<>\"\")*(OFFSET($A$9,0,1,1,372))*((OFFSET($A55,0,1,1,372))=NL$6)))","v":""},{"$f":"IF(SUMPRODUCT((OFFSET($A55,0,1,1,372)<>\"\")*(OFFSET($A$9,0,1,1,372))*((OFFSET($A55,0,1,1,372))=NL$7))=0,\"\",SUMPRODUCT((OFFSET($A55,0,1,1,372)<>\"\")*(OFFSET($A$9,0,1,1,372))*((OFFSET($A55,0,1,1,372))=NL$7)))","v":""},{"$f":"IF(SUMPRODUCT((OFFSET($A55,0,1,1,372)<>\"\")*(OFFSET($A$9,0,1,1,372))*((OFFSET($A55,0,1,1,372))=NL$8))=0,\"\",SUMPRODUCT((OFFSET($A55,0,1,1,372)<>\"\")*(OFFSET($A$9,0,1,1,372))*((OFFSET($A55,0,1,1,372))=NL$8)))","v":""},{"$f":"IF(SUMPRODUCT((OFFSET($A55,0,1,1,372)<>\"\")*(OFFSET($A$9,0,1,1,372))*((OFFSET($A55,0,1,1,372))=NL$9))=0,\"\",SUMPRODUCT((OFFSET($A55,0,1,1,372)<>\"\")*(OFFSET($A$9,0,1,1,372))*((OFFSET($A55,0,1,1,372))=NL$9)))","v":""}]
[null,null,null,null,null,null,null,null,null,null,null,null,null,null,null,null,null,null,null,null,null,null,null,null,null,null,null,null,null,null,null,null,null,null,null,null,null,null,null,null,null,null,null,null,null,null,null,null,null,null,null,null,null,null,null,null,null,null,null,null,null,null,null,null,null,null,null,null,null,null,null,null,null,null,null,null,null,null,null,null,null,null,null,null,null,null,null,null,null,null,null,null,null,null,null,null,null,null,null,null,null,null,null,null,null,null,null,null,null,null,null,null,null,null,null,null,null,null,null,null,null,null,null,null,null,null,null,null,null,null,null,null,null,null,null,null,null,null,null,null,null,null,null,null,null,null,null,null,null,null,null,null,null,null,null,null,null,null,null,null,null,null,null,null,null,null,null,null,null,null,null,null,null,null,null,null,null,null,null,null,null,null,null,null,null,null,null,null,null,null,null,null,null,null,null,null,null,null,null,null,null,null,null,null,null,null,null,null,null,null,null,null,null,null,null,null,null,null,null,null,null,null,null,null,null,null,null,null,null,null,null,null,null,null,null,null,null,null,null,null,null,null,null,null,null,null,null,null,null,null,null,null,null,null,null,null,null,null,null,null,null,null,null,null,null,null,null,null,null,null,null,null,null,null,null,null,null,null,null,null,null,null,null,null,null,null,null,null,null,null,null,null,null,null,null,null,null,null,null,null,null,null,null,null,null,null,null,null,null,null,null,null,null,null,null,null,null,null,null,null,null,null,null,null,null,null,null,null,null,null,null,null,null,null,null,null,null,null,null,null,null,null,null,null,null,null,null,null,null,null,null,null,null,null,null,null,null,null,null,null,null,null,null,null,null,null,null,null,null,null,null,null,null,null,null,null,null,{"$f":"IF(SUMPRODUCT((OFFSET($A56,0,31*($A$9-1)+1,1,31)<>\"\")*(IF(OFFSET($A56,0,31*($A$9-1)+1,1,31)=$NL$9,0.5,1)*(OFFSET($A$9,0,31*($A$9-1)+1,1,31))))=0,\"\",SUMPRODUCT((OFFSET($A56,0,31*($A$9-1)+1,1,31)<>\"\")*(IF(OFFSET($A56,0,31*($A$9-1)+1,1,31)=$NL$9,0.5,1)*(OFFSET($A$9,0,31*($A$9-1)+1,1,31)))))","v":""},{"$f":"IF(SUMPRODUCT((OFFSET($A56,0,1,1,372)<>\"\")*(IF(OFFSET($A56,0,1,1,372)=$NL$9,0.5,1)*(OFFSET($A$9,0,1,1,372))))=0,\"\",SUMPRODUCT((OFFSET($A56,0,1,1,372)<>\"\")*(IF(OFFSET($A56,0,1,1,372)=$NL$9,0.5,1)*(OFFSET($A$9,0,1,1,372)))))","v":""},"",null,{"$f":"IF(SUMPRODUCT((OFFSET($A56,0,1,1,372)<>\"\")*(OFFSET($A$9,0,1,1,372))*((OFFSET($A56,0,1,1,372))=NL$5))=0,\"\",SUMPRODUCT((OFFSET($A56,0,1,1,372)<>\"\")*(OFFSET($A$9,0,1,1,372))*((OFFSET($A56,0,1,1,372))=NL$5)))","v":""},{"$f":"IF(SUMPRODUCT((OFFSET($A56,0,1,1,372)<>\"\")*(OFFSET($A$9,0,1,1,372))*((OFFSET($A56,0,1,1,372))=NL$6))=0,\"\",SUMPRODUCT((OFFSET($A56,0,1,1,372)<>\"\")*(OFFSET($A$9,0,1,1,372))*((OFFSET($A56,0,1,1,372))=NL$6)))","v":""},{"$f":"IF(SUMPRODUCT((OFFSET($A56,0,1,1,372)<>\"\")*(OFFSET($A$9,0,1,1,372))*((OFFSET($A56,0,1,1,372))=NL$7))=0,\"\",SUMPRODUCT((OFFSET($A56,0,1,1,372)<>\"\")*(OFFSET($A$9,0,1,1,372))*((OFFSET($A56,0,1,1,372))=NL$7)))","v":""},{"$f":"IF(SUMPRODUCT((OFFSET($A56,0,1,1,372)<>\"\")*(OFFSET($A$9,0,1,1,372))*((OFFSET($A56,0,1,1,372))=NL$8))=0,\"\",SUMPRODUCT((OFFSET($A56,0,1,1,372)<>\"\")*(OFFSET($A$9,0,1,1,372))*((OFFSET($A56,0,1,1,372))=NL$8)))","v":""},{"$f":"IF(SUMPRODUCT((OFFSET($A56,0,1,1,372)<>\"\")*(OFFSET($A$9,0,1,1,372))*((OFFSET($A56,0,1,1,372))=NL$9))=0,\"\",SUMPRODUCT((OFFSET($A56,0,1,1,372)<>\"\")*(OFFSET($A$9,0,1,1,372))*((OFFSET($A56,0,1,1,372))=NL$9)))","v":""}]
[null,null,null,null,null,null,null,null,null,null,null,null,null,null,null,null,null,null,null,null,null,null,null,null,null,null,null,null,null,null,null,null,null,null,null,null,null,null,null,null,null,null,null,null,null,null,null,null,null,null,null,null,null,null,null,null,null,null,null,null,null,null,null,null,null,null,null,null,null,null,null,null,null,null,null,null,null,null,null,null,null,null,null,null,null,null,null,null,null,null,null,null,null,null,null,null,null,null,null,null,null,null,null,null,null,null,null,null,null,null,null,null,null,null,null,null,null,null,null,null,null,null,null,null,null,null,null,null,null,null,null,null,null,null,null,null,null,null,null,null,null,null,null,null,null,null,null,null,null,null,null,null,null,null,null,null,null,null,null,null,null,null,null,null,null,null,null,null,null,null,null,null,null,null,null,null,null,null,null,null,null,null,null,null,null,null,null,null,null,null,null,null,null,null,null,null,null,null,null,null,null,null,null,null,null,null,null,null,null,null,null,null,null,null,null,null,null,null,null,null,null,null,null,null,null,null,null,null,null,null,null,null,null,null,null,null,null,null,null,null,null,null,null,null,null,null,null,null,null,null,null,null,null,null,null,null,null,null,null,null,null,null,null,null,null,null,null,null,null,null,null,null,null,null,null,null,null,null,null,null,null,null,null,null,null,null,null,null,null,null,null,null,null,null,null,null,null,null,null,null,null,null,null,null,null,null,null,null,null,null,null,null,null,null,null,null,null,null,null,null,null,null,null,null,null,null,null,null,null,null,null,null,null,null,null,null,null,null,null,null,null,null,null,null,null,null,null,null,null,null,null,null,null,null,null,null,null,null,null,null,null,null,null,null,null,null,null,null,null,null,null,null,null,null,null,null,null,{"$f":"IF(SUMPRODUCT((OFFSET($A57,0,31*($A$9-1)+1,1,31)<>\"\")*(IF(OFFSET($A57,0,31*($A$9-1)+1,1,31)=$NL$9,0.5,1)*(OFFSET($A$9,0,31*($A$9-1)+1,1,31))))=0,\"\",SUMPRODUCT((OFFSET($A57,0,31*($A$9-1)+1,1,31)<>\"\")*(IF(OFFSET($A57,0,31*($A$9-1)+1,1,31)=$NL$9,0.5,1)*(OFFSET($A$9,0,31*($A$9-1)+1,1,31)))))","v":""},{"$f":"IF(SUMPRODUCT((OFFSET($A57,0,1,1,372)<>\"\")*(IF(OFFSET($A57,0,1,1,372)=$NL$9,0.5,1)*(OFFSET($A$9,0,1,1,372))))=0,\"\",SUMPRODUCT((OFFSET($A57,0,1,1,372)<>\"\")*(IF(OFFSET($A57,0,1,1,372)=$NL$9,0.5,1)*(OFFSET($A$9,0,1,1,372)))))","v":""},"",null,{"$f":"IF(SUMPRODUCT((OFFSET($A57,0,1,1,372)<>\"\")*(OFFSET($A$9,0,1,1,372))*((OFFSET($A57,0,1,1,372))=NL$5))=0,\"\",SUMPRODUCT((OFFSET($A57,0,1,1,372)<>\"\")*(OFFSET($A$9,0,1,1,372))*((OFFSET($A57,0,1,1,372))=NL$5)))","v":""},{"$f":"IF(SUMPRODUCT((OFFSET($A57,0,1,1,372)<>\"\")*(OFFSET($A$9,0,1,1,372))*((OFFSET($A57,0,1,1,372))=NL$6))=0,\"\",SUMPRODUCT((OFFSET($A57,0,1,1,372)<>\"\")*(OFFSET($A$9,0,1,1,372))*((OFFSET($A57,0,1,1,372))=NL$6)))","v":""},{"$f":"IF(SUMPRODUCT((OFFSET($A57,0,1,1,372)<>\"\")*(OFFSET($A$9,0,1,1,372))*((OFFSET($A57,0,1,1,372))=NL$7))=0,\"\",SUMPRODUCT((OFFSET($A57,0,1,1,372)<>\"\")*(OFFSET($A$9,0,1,1,372))*((OFFSET($A57,0,1,1,372))=NL$7)))","v":""},{"$f":"IF(SUMPRODUCT((OFFSET($A57,0,1,1,372)<>\"\")*(OFFSET($A$9,0,1,1,372))*((OFFSET($A57,0,1,1,372))=NL$8))=0,\"\",SUMPRODUCT((OFFSET($A57,0,1,1,372)<>\"\")*(OFFSET($A$9,0,1,1,372))*((OFFSET($A57,0,1,1,372))=NL$8)))","v":""},{"$f":"IF(SUMPRODUCT((OFFSET($A57,0,1,1,372)<>\"\")*(OFFSET($A$9,0,1,1,372))*((OFFSET($A57,0,1,1,372))=NL$9))=0,\"\",SUMPRODUCT((OFFSET($A57,0,1,1,372)<>\"\")*(OFFSET($A$9,0,1,1,372))*((OFFSET($A57,0,1,1,372))=NL$9)))","v":""}]
[null,null,null,null,null,null,null,null,null,null,null,null,null,null,null,null,null,null,null,null,null,null,null,null,null,null,null,null,null,null,null,null,null,null,null,null,null,null,null,null,null,null,null,null,null,null,null,null,null,null,null,null,null,null,null,null,null,null,null,null,null,null,null,null,null,null,null,null,null,null,null,null,null,null,null,null,null,null,null,null,null,null,null,null,null,null,null,null,null,null,null,null,null,null,null,null,null,null,null,null,null,null,null,null,null,null,null,null,null,null,null,null,null,null,null,null,null,null,null,null,null,null,null,null,null,null,null,null,null,null,null,null,null,null,null,null,null,null,null,null,null,null,null,null,null,null,null,null,null,null,null,null,null,null,null,null,null,null,null,null,null,null,null,null,null,null,null,null,null,null,null,null,null,null,null,null,null,null,null,null,null,null,null,null,null,null,null,null,null,null,null,null,null,null,null,null,null,null,null,null,null,null,null,null,null,null,null,null,null,null,null,null,null,null,null,null,null,null,null,null,null,null,null,null,null,null,null,null,null,null,null,null,null,null,null,null,null,null,null,null,null,null,null,null,null,null,null,null,null,null,null,null,null,null,null,null,null,null,null,null,null,null,null,null,null,null,null,null,null,null,null,null,null,null,null,null,null,null,null,null,null,null,null,null,null,null,null,null,null,null,null,null,null,null,null,null,null,null,null,null,null,null,null,null,null,null,null,null,null,null,null,null,null,null,null,null,null,null,null,null,null,null,null,null,null,null,null,null,null,null,null,null,null,null,null,null,null,null,null,null,null,null,null,null,null,null,null,null,null,null,null,null,null,null,null,null,null,null,null,null,null,null,null,null,null,null,null,null,null,null,null,null,null,null,null,null,null,{"$f":"IF(SUMPRODUCT((OFFSET($A58,0,31*($A$9-1)+1,1,31)<>\"\")*(IF(OFFSET($A58,0,31*($A$9-1)+1,1,31)=$NL$9,0.5,1)*(OFFSET($A$9,0,31*($A$9-1)+1,1,31))))=0,\"\",SUMPRODUCT((OFFSET($A58,0,31*($A$9-1)+1,1,31)<>\"\")*(IF(OFFSET($A58,0,31*($A$9-1)+1,1,31)=$NL$9,0.5,1)*(OFFSET($A$9,0,31*($A$9-1)+1,1,31)))))","v":""},{"$f":"IF(SUMPRODUCT((OFFSET($A58,0,1,1,372)<>\"\")*(IF(OFFSET($A58,0,1,1,372)=$NL$9,0.5,1)*(OFFSET($A$9,0,1,1,372))))=0,\"\",SUMPRODUCT((OFFSET($A58,0,1,1,372)<>\"\")*(IF(OFFSET($A58,0,1,1,372)=$NL$9,0.5,1)*(OFFSET($A$9,0,1,1,372)))))","v":""},"",null,{"$f":"IF(SUMPRODUCT((OFFSET($A58,0,1,1,372)<>\"\")*(OFFSET($A$9,0,1,1,372))*((OFFSET($A58,0,1,1,372))=NL$5))=0,\"\",SUMPRODUCT((OFFSET($A58,0,1,1,372)<>\"\")*(OFFSET($A$9,0,1,1,372))*((OFFSET($A58,0,1,1,372))=NL$5)))","v":""},{"$f":"IF(SUMPRODUCT((OFFSET($A58,0,1,1,372)<>\"\")*(OFFSET($A$9,0,1,1,372))*((OFFSET($A58,0,1,1,372))=NL$6))=0,\"\",SUMPRODUCT((OFFSET($A58,0,1,1,372)<>\"\")*(OFFSET($A$9,0,1,1,372))*((OFFSET($A58,0,1,1,372))=NL$6)))","v":""},{"$f":"IF(SUMPRODUCT((OFFSET($A58,0,1,1,372)<>\"\")*(OFFSET($A$9,0,1,1,372))*((OFFSET($A58,0,1,1,372))=NL$7))=0,\"\",SUMPRODUCT((OFFSET($A58,0,1,1,372)<>\"\")*(OFFSET($A$9,0,1,1,372))*((OFFSET($A58,0,1,1,372))=NL$7)))","v":""},{"$f":"IF(SUMPRODUCT((OFFSET($A58,0,1,1,372)<>\"\")*(OFFSET($A$9,0,1,1,372))*((OFFSET($A58,0,1,1,372))=NL$8))=0,\"\",SUMPRODUCT((OFFSET($A58,0,1,1,372)<>\"\")*(OFFSET($A$9,0,1,1,372))*((OFFSET($A58,0,1,1,372))=NL$8)))","v":""},{"$f":"IF(SUMPRODUCT((OFFSET($A58,0,1,1,372)<>\"\")*(OFFSET($A$9,0,1,1,372))*((OFFSET($A58,0,1,1,372))=NL$9))=0,\"\",SUMPRODUCT((OFFSET($A58,0,1,1,372)<>\"\")*(OFFSET($A$9,0,1,1,372))*((OFFSET($A58,0,1,1,372))=NL$9)))","v":""}]
["X","X","X","X","X","X","X","X","X","X","X","X","X","X","X","X","X","X","X","X","X","X","X","X","X","X","X","X","X","X","X","X","X","X","X","X","X","X","X","X","X","X","X","X","X","X","X","X","X","X","X","X","X","X","X","X","X","X","X","X","X","X","X","X","X","X","X","X","X","X","X","X","X","X","X","X","X","X","X","X","X","X","X","X","X","X","X","X","X","X","X","X","X","X","X","X","X","X","X","X","X","X","X","X","X","X","X","X","X","X","X","X","X","X","X","X","X","X","X","X","X","X","X","X","X","X","X","X","X","X","X","X","X","X","X","X","X","X","X","X","X","X","X","X","X","X","X","X","X","X","X","X","X","X","X","X","X","X","X","X","X","X","X","X","X","X","X","X","X","X","X","X","X","X","X","X","X","X","X","X","X","X","X","X","X","X","X","X","X","X","X","X","X","X","X","X","X","X","X","X","X","X","X","X","X","X","X","X","X","X","X","X","X","X","X","X","X","X","X","X","X","X","X","X","X","X","X","X","X","X","X","X","X","X","X","X","X","X","X","X","X","X","X","X","X","X","X","X","X","X","X","X","X","X","X","X","X","X","X","X","X","X","X","X","X","X","X","X","X","X","X","X","X","X","X","X","X","X","X","X","X","X","X","X","X","X","X","X","X","X","X","X","X","X","X","X","X","X","X","X","X","X","X","X","X","X","X","X","X","X","X","X","X","X","X","X","X","X","X","X","X","X","X","X","X","X","X","X","X","X","X","X","X","X","X","X","X","X","X","X","X","X","X","X","X","X","X","X","X","X","X","X","X","X","X","X","X","X","X","X","X","X","X","X","X","X","X","X","X","X","X","X","X",null,"X",null,null,{"$f":"IF(SUMPRODUCT((OFFSET($A59,0,31*($A$9-1)+1,1,31)<>\"\")*(IF(OFFSET($A59,0,31*($A$9-1)+1,1,31)=$NL$9,0.5,1)*(OFFSET($A$9,0,31*($A$9-1)+1,1,31))))=0,\"\",SUMPRODUCT((OFFSET($A59,0,31*($A$9-1)+1,1,31)<>\"\")*(IF(OFFSET($A59,0,31*($A$9-1)+1,1,31)=$NL$9,0.5,1)*(OFFSET($A$9,0,31*($A$9-1)+1,1,31)))))","v":21},{"$f":"IF(SUMPRODUCT((OFFSET($A59,0,1,1,372)<>\"\")*(IF(OFFSET($A59,0,1,1,372)=$NL$9,0.5,1)*(OFFSET($A$9,0,1,1,372))))=0,\"\",SUMPRODUCT((OFFSET($A59,0,1,1,372)<>\"\")*(IF(OFFSET($A59,0,1,1,372)=$NL$9,0.5,1)*(OFFSET($A$9,0,1,1,372)))))","v":267},"",null,{"$f":"IF(SUMPRODUCT((OFFSET($A59,0,1,1,372)<>\"\")*(OFFSET($A$9,0,1,1,372))*((OFFSET($A59,0,1,1,372))=NL$5))=0,\"\",SUMPRODUCT((OFFSET($A59,0,1,1,372)<>\"\")*(OFFSET($A$9,0,1,1,372))*((OFFSET($A59,0,1,1,372))=NL$5)))","v":""},{"$f":"IF(SUMPRODUCT((OFFSET($A59,0,1,1,372)<>\"\")*(OFFSET($A$9,0,1,1,372))*((OFFSET($A59,0,1,1,372))=NL$6))=0,\"\",SUMPRODUCT((OFFSET($A59,0,1,1,372)<>\"\")*(OFFSET($A$9,0,1,1,372))*((OFFSET($A59,0,1,1,372))=NL$6)))","v":""},{"$f":"IF(SUMPRODUCT((OFFSET($A59,0,1,1,372)<>\"\")*(OFFSET($A$9,0,1,1,372))*((OFFSET($A59,0,1,1,372))=NL$7))=0,\"\",SUMPRODUCT((OFFSET($A59,0,1,1,372)<>\"\")*(OFFSET($A$9,0,1,1,372))*((OFFSET($A59,0,1,1,372))=NL$7)))","v":""},{"$f":"IF(SUMPRODUCT((OFFSET($A59,0,1,1,372)<>\"\")*(OFFSET($A$9,0,1,1,372))*((OFFSET($A59,0,1,1,372))=NL$8))=0,\"\",SUMPRODUCT((OFFSET($A59,0,1,1,372)<>\"\")*(OFFSET($A$9,0,1,1,372))*((OFFSET($A59,0,1,1,372))=NL$8)))","v":""},{"$f":"IF(SUMPRODUCT((OFFSET($A59,0,1,1,372)<>\"\")*(OFFSET($A$9,0,1,1,372))*((OFFSET($A59,0,1,1,372))=NL$9))=0,\"\",SUMPRODUCT((OFFSET($A59,0,1,1,372)<>\"\")*(OFFSET($A$9,0,1,1,372))*((OFFSET($A59,0,1,1,372))=NL$9)))","v":""}]

{"sheet":"Feriados y días laborables","index":2,"n_rows":11,"n_cols":6,"rows_kept":11,"cut":false,"hidden":false,"merged":[]}
[]
[]
[null,"Liste los feriados y días no laborables",null,null,"Especifique los días de semana laborables"]
[null,"Feriado","Fecha",null,"Días Laborables"]
[null,"Año Nuevo","2020-01-01",null,"Lun","Si"]
[null,null,null,null,"Mar","Si"]
[null,null,null,null,"Mie","Si"]
[null,null,null,null,"Jue","Si"]
[null,null,null,null,"Vie","Si"]
[null,null,null,null,"Sab","No"]
[null,null,null,null,"Dom","No"]

{"sheet":"Auxiliar","index":3,"n_rows":19,"n_cols":6,"rows_kept":19,"cut":false,"hidden":true,"merged":[]}
["Enero",1,null,1,"Lun",2019]
["Febrero",2,null,2,"Mar",2020]
["Marzo",3,null,3,"Mie",2021]
["Abril",4,null,4,"Jue",2022]
["Mayo",5,null,5,"Vie",2023]
["Junio",6,null,6,"Sab",2024]
["Julio",7,null,7,"Dom",2025]
["Agosto",8,null,null,null,2026]
["Septiembre",9,null,null,null,2027]
["Octubre",10,null,null,null,2028]
["Noviembre",11,null,null,null,2029]
["Diciembre",12,null,null,null,2030]
[null,null,null,null,null,2031]
[null,null,null,null,null,2032]
[null,null,null,null,null,2033]
[null,null,null,null,null,2034]
[null,null,null,null,null,2035]
[null,null,null,null,null,2036]
[null,null,null,null,null,2037]